{
	"info": {
		"_postman_id": "833e109a-d4c9-41cf-bafc-6b5a4b6303b7",
		"name": "t1e",
		"schema": "https://schema.getpostman.com/json/collection/v2.1.0/collection.json"
	},
	"item": [
		{
			"name": "Login Test",
			"request": {
				"method": "POST",
				"header": [],
				"body": {
					"mode": "raw",
					"raw": "{\r\n\"email\": \"leo.bouchan@gmail.com\",\r\n\"secret\": \"holacontrasena\"\r\n}",
					"options": {
						"raw": {
							"language": "json"
						}
					}
				},
				"url": {
					"raw": "http://localhost:3000/login",
					"protocol": "http",
					"host": [
						"localhost"
					],
					"port": "3000",
					"path": [
						"login"
					]
				}
			},
			"response": []
		},
		{
			"name": "Login Test AWS",
			"request": {
				"method": "POST",
				"header": [],
				"body": {
					"mode": "raw",
					"raw": "{\r\n\"email\": \"leo.bouchan@gmail.com\",\r\n\"secret\": \"holacontrasena\"\r\n}",
					"options": {
						"raw": {
							"language": "json"
						}
					}
				},
				"url": {
					"raw": "https://ptr59e1hei.execute-api.us-east-1.amazonaws.com/dev/login",
					"protocol": "https",
					"host": [
						"ptr59e1hei",
						"execute-api",
						"us-east-1",
						"amazonaws",
						"com"
					],
					"path": [
						"dev",
						"login"
					]
				}
			},
			"response": []
		},
		{
			"name": "GetAllUsers",
			"request": {
				"method": "GET",
				"header": [],
				"url": {
					"raw": "http://localhost:3000/",
					"protocol": "http",
					"host": [
						"localhost"
					],
					"port": "3000",
					"path": [
						""
					]
				}
			},
			"response": []
		},
		{
			"name": "GetAllUsers AWS",
			"request": {
				"method": "GET",
				"header": [],
				"url": {
					"raw": "https://ptr59e1hei.execute-api.us-east-1.amazonaws.com/dev/",
					"protocol": "https",
					"host": [
						"ptr59e1hei",
						"execute-api",
						"us-east-1",
						"amazonaws",
						"com"
					],
					"path": [
						"dev",
						""
					]
				}
			},
			"response": []
		},
		{
			"name": "GetOneUser AWS",
			"request": {
				"method": "GET",
				"header": [],
				"url": {
					"raw": "https://ptr59e1hei.execute-api.us-east-1.amazonaws.com/dev/62673df58544555c1e938bdf",
					"protocol": "https",
					"host": [
						"ptr59e1hei",
						"execute-api",
						"us-east-1",
						"amazonaws",
						"com"
					],
					"path": [
						"dev",
						"62673df58544555c1e938bdf"
					]
				}
			},
			"response": []
		},
		{
			"name": "GetOneUser",
			"request": {
				"method": "GET",
				"header": [],
				"url": {
					"raw": "http://localhost:3000/62673df58544555c1e938bdf",
					"protocol": "http",
					"host": [
						"localhost"
					],
					"port": "3000",
					"path": [
						"62673df58544555c1e938bdf"
					]
				}
			},
			"response": []
		},
		{
			"name": "ValidateToken",
			"request": {
				"method": "POST",
				"header": [
					{
						"key": "x-access-token",
						"value": "eyJhbGciOiJIUzI1NiIsInR5cCI6IkpXVCJ9.eyJ1c2VyX2lkIjoiNjI2NzNkZjU4NTQ0NTU1YzFlOTM4YmRmIiwiZW1haWwiOiJsZW8uYm91Y2hhbkBnbWFpbC5jb20iLCJpYXQiOjE2NTEwNDUyNDUsImV4cCI6MTY1MTA1MjQ0NX0.QuHYZ6OVk4UUyKk3QI1giN0E7cf2f2Fkszhp44epyk0",
						"type": "text"
					}
				],
				"url": {
					"raw": "http://localhost:3000/check",
					"protocol": "http",
					"host": [
						"localhost"
					],
					"port": "3000",
					"path": [
						"check"
					]
				}
			},
			"response": []
		},
		{
			"name": "ValidateToken AWS",
			"request": {
				"method": "POST",
				"header": [
					{
						"key": "x-access-token",
						"value": "eyJhbGciOiJIUzI1NiIsInR5cCI6IkpXVCJ9.eyJ1c2VyX2lkIjoiNjI2NzNkZjU4NTQ0NTU1YzFlOTM4YmRmIiwiZW1haWwiOiJsZW8uYm91Y2hhbkBnbWFpbC5jb20iLCJpYXQiOjE2NTEwNjk3ODYsImV4cCI6MTY1MTA3Njk4Nn0.bVCsu1CijXk3Nb24Oh-WDuAnDa8WpyIH2axB6WMpiz4",
						"type": "text"
					}
				],
				"url": {
					"raw": "https://ptr59e1hei.execute-api.us-east-1.amazonaws.com/dev/check",
					"protocol": "https",
					"host": [
						"ptr59e1hei",
						"execute-api",
						"us-east-1",
						"amazonaws",
						"com"
					],
					"path": [
						"dev",
						"check"
					]
				}
			},
			"response": []
		},
		{
			"name": "PostUser",
			"request": {
				"method": "POST",
				"header": [],
				"body": {
					"mode": "raw",
					"raw": "{\r\n    \"name\": \"Leonardo\",\r\n    \"lastName\": \"Bouchan\",\r\n    \"lastName2\": \"Juarez\",\r\n    \"phone\": \"5527375421\",\r\n    \"email\": \"leo.bouchan@gmail.com\",\r\n    \"username\": \"liobouchan\",\r\n    \"secret\": \"holacontrasena\"\r\n}",
					"options": {
						"raw": {
							"language": "json"
						}
					}
				},
				"url": {
					"raw": "http://localhost:3000/",
					"protocol": "http",
					"host": [
						"localhost"
					],
					"port": "3000",
					"path": [
						""
					]
				}
			},
			"response": []
		},
		{
			"name": "PostUser AWS",
			"request": {
				"method": "POST",
				"header": [],
				"body": {
					"mode": "raw",
					"raw": "{\r\n    \"name\": \"Leonardo\",\r\n    \"lastName\": \"Bouchan\",\r\n    \"lastName2\": \"Juarez\",\r\n    \"phone\": \"5527375421\",\r\n    \"email\": \"leo.bouchan@gmail.com\",\r\n    \"username\": \"liobouchan\",\r\n    \"secret\": \"holacontrasena\"\r\n}",
					"options": {
						"raw": {
							"language": "json"
						}
					}
				},
				"url": {
					"raw": "https://ptr59e1hei.execute-api.us-east-1.amazonaws.com/dev/",
					"protocol": "https",
					"host": [
						"ptr59e1hei",
						"execute-api",
						"us-east-1",
						"amazonaws",
						"com"
					],
					"path": [
						"dev",
						""
					]
				}
			},
			"response": []
		}
	]
}