{
	"info": {
		"_postman_id": "08fcc1e9-1633-485b-baf7-9acc9282da25",
		"name": "TESTBaz",
		"schema": "https://schema.getpostman.com/json/collection/v2.1.0/collection.json"
	},
	"item": [
		{
			"name": "GET all Users",
			"request": {
				"method": "GET",
				"header": [],
				"url": {
					"raw": "http://localhost:3000/dev/user",
					"protocol": "http",
					"host": [
						"localhost"
					],
					"port": "3000",
					"path": [
						"dev",
						"user"
					]
				}
			},
			"response": []
		},
		{
			"name": "Post User",
			"request": {
				"method": "POST",
				"header": [],
				"body": {
					"mode": "raw",
					"raw": "{\r\n    \"name\": \"Leonardo\",\r\n    \"lastName\": \"Bouchan\",\r\n    \"lastName2\": \"Juarez\",\r\n    \"phone\": \"5527375421\",\r\n    \"email\": \"leo.bouchan@gmail.com\",\r\n    \"username\": \"liobouchan\",\r\n    \"secret\": \"holacontrasena\"\r\n}",
					"options": {
						"raw": {
							"language": "json"
						}
					}
				},
				"url": {
					"raw": "http://localhost:3000/dev/user",
					"protocol": "http",
					"host": [
						"localhost"
					],
					"port": "3000",
					"path": [
						"dev",
						"user"
					]
				}
			},
			"response": []
		}
	]
}