%YAML 1.1
%TAG !u! tag:unity3d.com,2011:
--- !u!114 &11400000
MonoBehaviour:
  m_ObjectHideFlags: 0
  m_CorrespondingSourceObject: {fileID: 0}
  m_PrefabInternal: {fileID: 0}
  m_GameObject: {fileID: 0}
  m_Enabled: 1
  m_EditorHideFlags: 0
  m_Script: {fileID: 11500000, guid: 9c461a29a1963b94bb2ba5435094f7f3, type: 3}
  m_Name: UIHitData
  m_EditorClassIdentifier: 
  hitPosition: {x: 0.7461013, y: -0.6010031, z: -5.303779}
  raycastOrigin: {x: 0.85523057, y: -0.6877877, z: -5.4325476}
  hitObject: {fileID: 0}
