%YAML 1.1
%TAG !u! tag:unity3d.com,2011:
--- !u!29 &1
OcclusionCullingSettings:
  m_ObjectHideFlags: 0
  serializedVersion: 2
  m_OcclusionBakeSettings:
    smallestOccluder: 5
    smallestHole: 0.25
    backfaceThreshold: 100
  m_SceneGUID: 00000000000000000000000000000000
  m_OcclusionCullingData: {fileID: 0}
--- !u!104 &2
RenderSettings:
  m_ObjectHideFlags: 0
  serializedVersion: 9
  m_Fog: 0
  m_FogColor: {r: 0.5, g: 0.5, b: 0.5, a: 1}
  m_FogMode: 3
  m_FogDensity: 0.01
  m_LinearFogStart: 0
  m_LinearFogEnd: 300
  m_AmbientSkyColor: {r: 0.212, g: 0.227, b: 0.259, a: 1}
  m_AmbientEquatorColor: {r: 0.114, g: 0.125, b: 0.133, a: 1}
  m_AmbientGroundColor: {r: 0.047, g: 0.043, b: 0.035, a: 1}
  m_AmbientIntensity: 1
  m_AmbientMode: 0
  m_SubtractiveShadowColor: {r: 0.42, g: 0.478, b: 0.627, a: 1}
  m_SkyboxMaterial: {fileID: 10304, guid: 0000000000000000f000000000000000, type: 0}
  m_HaloStrength: 0.5
  m_FlareStrength: 1
  m_FlareFadeSpeed: 3
  m_HaloTexture: {fileID: 0}
  m_SpotCookie: {fileID: 10001, guid: 0000000000000000e000000000000000, type: 0}
  m_DefaultReflectionMode: 0
  m_DefaultReflectionResolution: 128
  m_ReflectionBounces: 1
  m_ReflectionIntensity: 1
  m_CustomReflection: {fileID: 0}
  m_Sun: {fileID: 705507994}
  m_IndirectSpecularColor: {r: 0, g: 0, b: 0, a: 1}
  m_UseRadianceAmbientProbe: 0
--- !u!157 &3
LightmapSettings:
  m_ObjectHideFlags: 0
  serializedVersion: 11
  m_GIWorkflowMode: 1
  m_GISettings:
    serializedVersion: 2
    m_BounceScale: 1
    m_IndirectOutputScale: 1
    m_AlbedoBoost: 1
    m_EnvironmentLightingMode: 0
    m_EnableBakedLightmaps: 1
    m_EnableRealtimeLightmaps: 0
  m_LightmapEditorSettings:
    serializedVersion: 12
    m_Resolution: 2
    m_BakeResolution: 40
    m_AtlasSize: 1024
    m_AO: 0
    m_AOMaxDistance: 1
    m_CompAOExponent: 1
    m_CompAOExponentDirect: 0
    m_ExtractAmbientOcclusion: 0
    m_Padding: 2
    m_LightmapParameters: {fileID: 0}
    m_LightmapsBakeMode: 1
    m_TextureCompression: 1
    m_FinalGather: 0
    m_FinalGatherFiltering: 1
    m_FinalGatherRayCount: 256
    m_ReflectionCompression: 2
    m_MixedBakeMode: 2
    m_BakeBackend: 1
    m_PVRSampling: 1
    m_PVRDirectSampleCount: 32
    m_PVRSampleCount: 500
    m_PVRBounces: 2
    m_PVREnvironmentSampleCount: 500
    m_PVREnvironmentReferencePointCount: 2048
    m_PVRFilteringMode: 2
    m_PVRDenoiserTypeDirect: 0
    m_PVRDenoiserTypeIndirect: 0
    m_PVRDenoiserTypeAO: 0
    m_PVRFilterTypeDirect: 0
    m_PVRFilterTypeIndirect: 0
    m_PVRFilterTypeAO: 0
    m_PVREnvironmentMIS: 0
    m_PVRCulling: 1
    m_PVRFilteringGaussRadiusDirect: 1
    m_PVRFilteringGaussRadiusIndirect: 5
    m_PVRFilteringGaussRadiusAO: 2
    m_PVRFilteringAtrousPositionSigmaDirect: 0.5
    m_PVRFilteringAtrousPositionSigmaIndirect: 2
    m_PVRFilteringAtrousPositionSigmaAO: 1
    m_ExportTrainingData: 0
    m_TrainingDataDestination: TrainingData
    m_LightProbeSampleCountMultiplier: 4
  m_LightingDataAsset: {fileID: 0}
  m_UseShadowmask: 1
--- !u!196 &4
NavMeshSettings:
  serializedVersion: 2
  m_ObjectHideFlags: 0
  m_BuildSettings:
    serializedVersion: 2
    agentTypeID: 0
    agentRadius: 0.5
    agentHeight: 2
    agentSlope: 45
    agentClimb: 0.4
    ledgeDropHeight: 0
    maxJumpAcrossDistance: 0
    minRegionArea: 2
    manualCellSize: 0
    cellSize: 0.16666667
    manualTileSize: 0
    tileSize: 256
    accuratePlacement: 0
    debug:
      m_Flags: 0
  m_NavMeshData: {fileID: 0}
--- !u!1001 &82197251
PrefabInstance:
  m_ObjectHideFlags: 0
  serializedVersion: 2
  m_Modification:
    m_TransformParent: {fileID: 1497094537}
    m_Modifications:
    - target: {fileID: 165880, guid: f4f6b630159e6b34386dec2579f250b2, type: 3}
      propertyPath: m_Name
      value: ETower 1
      objectReference: {fileID: 0}
    - target: {fileID: 471166, guid: f4f6b630159e6b34386dec2579f250b2, type: 3}
      propertyPath: m_LocalPosition.x
      value: 2.5999985
      objectReference: {fileID: 0}
    - target: {fileID: 471166, guid: f4f6b630159e6b34386dec2579f250b2, type: 3}
      propertyPath: m_LocalPosition.y
      value: -59.179356
      objectReference: {fileID: 0}
    - target: {fileID: 471166, guid: f4f6b630159e6b34386dec2579f250b2, type: 3}
      propertyPath: m_LocalPosition.z
      value: -2.332205
      objectReference: {fileID: 0}
    - target: {fileID: 471166, guid: f4f6b630159e6b34386dec2579f250b2, type: 3}
      propertyPath: m_LocalRotation.x
      value: -0
      objectReference: {fileID: 0}
    - target: {fileID: 471166, guid: f4f6b630159e6b34386dec2579f250b2, type: 3}
      propertyPath: m_LocalRotation.y
      value: -0
      objectReference: {fileID: 0}
    - target: {fileID: 471166, guid: f4f6b630159e6b34386dec2579f250b2, type: 3}
      propertyPath: m_LocalRotation.z
      value: -0
      objectReference: {fileID: 0}
    - target: {fileID: 471166, guid: f4f6b630159e6b34386dec2579f250b2, type: 3}
      propertyPath: m_LocalRotation.w
      value: 1
      objectReference: {fileID: 0}
    - target: {fileID: 471166, guid: f4f6b630159e6b34386dec2579f250b2, type: 3}
      propertyPath: m_RootOrder
      value: 1
      objectReference: {fileID: 0}
    - target: {fileID: 471166, guid: f4f6b630159e6b34386dec2579f250b2, type: 3}
      propertyPath: m_LocalEulerAnglesHint.x
      value: 0
      objectReference: {fileID: 0}
    - target: {fileID: 471166, guid: f4f6b630159e6b34386dec2579f250b2, type: 3}
      propertyPath: m_LocalEulerAnglesHint.y
      value: 0
      objectReference: {fileID: 0}
    - target: {fileID: 471166, guid: f4f6b630159e6b34386dec2579f250b2, type: 3}
      propertyPath: m_LocalEulerAnglesHint.z
      value: 0
      objectReference: {fileID: 0}
    m_RemovedComponents: []
  m_SourcePrefab: {fileID: 100100000, guid: f4f6b630159e6b34386dec2579f250b2, type: 3}
--- !u!1001 &128234882
PrefabInstance:
  m_ObjectHideFlags: 0
  serializedVersion: 2
  m_Modification:
    m_TransformParent: {fileID: 1497094537}
    m_Modifications:
    - target: {fileID: 165880, guid: f4f6b630159e6b34386dec2579f250b2, type: 3}
      propertyPath: m_Name
      value: ETower (1)
      objectReference: {fileID: 0}
    - target: {fileID: 471166, guid: f4f6b630159e6b34386dec2579f250b2, type: 3}
      propertyPath: m_LocalPosition.x
      value: -19.160828
      objectReference: {fileID: 0}
    - target: {fileID: 471166, guid: f4f6b630159e6b34386dec2579f250b2, type: 3}
      propertyPath: m_LocalPosition.y
      value: -59.179356
      objectReference: {fileID: 0}
    - target: {fileID: 471166, guid: f4f6b630159e6b34386dec2579f250b2, type: 3}
      propertyPath: m_LocalPosition.z
      value: 94.7
      objectReference: {fileID: 0}
    - target: {fileID: 471166, guid: f4f6b630159e6b34386dec2579f250b2, type: 3}
      propertyPath: m_LocalRotation.x
      value: -0
      objectReference: {fileID: 0}
    - target: {fileID: 471166, guid: f4f6b630159e6b34386dec2579f250b2, type: 3}
      propertyPath: m_LocalRotation.y
      value: -0
      objectReference: {fileID: 0}
    - target: {fileID: 471166, guid: f4f6b630159e6b34386dec2579f250b2, type: 3}
      propertyPath: m_LocalRotation.z
      value: -0
      objectReference: {fileID: 0}
    - target: {fileID: 471166, guid: f4f6b630159e6b34386dec2579f250b2, type: 3}
      propertyPath: m_LocalRotation.w
      value: 1
      objectReference: {fileID: 0}
    - target: {fileID: 471166, guid: f4f6b630159e6b34386dec2579f250b2, type: 3}
      propertyPath: m_RootOrder
      value: 3
      objectReference: {fileID: 0}
    - target: {fileID: 471166, guid: f4f6b630159e6b34386dec2579f250b2, type: 3}
      propertyPath: m_LocalEulerAnglesHint.x
      value: 0
      objectReference: {fileID: 0}
    - target: {fileID: 471166, guid: f4f6b630159e6b34386dec2579f250b2, type: 3}
      propertyPath: m_LocalEulerAnglesHint.y
      value: 0
      objectReference: {fileID: 0}
    - target: {fileID: 471166, guid: f4f6b630159e6b34386dec2579f250b2, type: 3}
      propertyPath: m_LocalEulerAnglesHint.z
      value: 0
      objectReference: {fileID: 0}
    m_RemovedComponents: []
  m_SourcePrefab: {fileID: 100100000, guid: f4f6b630159e6b34386dec2579f250b2, type: 3}
--- !u!4 &181631808 stripped
Transform:
  m_CorrespondingSourceObject: {fileID: 471166, guid: f4f6b630159e6b34386dec2579f250b2,
    type: 3}
  m_PrefabInstance: {fileID: 1499962121}
  m_PrefabAsset: {fileID: 0}
--- !u!4 &328736071 stripped
Transform:
  m_CorrespondingSourceObject: {fileID: 471166, guid: f4f6b630159e6b34386dec2579f250b2,
    type: 3}
  m_PrefabInstance: {fileID: 1852166273}
  m_PrefabAsset: {fileID: 0}
--- !u!4 &330329014 stripped
Transform:
  m_CorrespondingSourceObject: {fileID: 471166, guid: f4f6b630159e6b34386dec2579f250b2,
    type: 3}
  m_PrefabInstance: {fileID: 1591262586}
  m_PrefabAsset: {fileID: 0}
--- !u!1001 &330424385
PrefabInstance:
  m_ObjectHideFlags: 0
  serializedVersion: 2
  m_Modification:
    m_TransformParent: {fileID: 1497094537}
    m_Modifications:
    - target: {fileID: 165880, guid: f4f6b630159e6b34386dec2579f250b2, type: 3}
      propertyPath: m_Name
      value: ETower 2 (2)
      objectReference: {fileID: 0}
    - target: {fileID: 471166, guid: f4f6b630159e6b34386dec2579f250b2, type: 3}
      propertyPath: m_LocalPosition.x
      value: 64.7
      objectReference: {fileID: 0}
    - target: {fileID: 471166, guid: f4f6b630159e6b34386dec2579f250b2, type: 3}
      propertyPath: m_LocalPosition.y
      value: -59.179356
      objectReference: {fileID: 0}
    - target: {fileID: 471166, guid: f4f6b630159e6b34386dec2579f250b2, type: 3}
      propertyPath: m_LocalPosition.z
      value: -14.3
      objectReference: {fileID: 0}
    - target: {fileID: 471166, guid: f4f6b630159e6b34386dec2579f250b2, type: 3}
      propertyPath: m_LocalRotation.x
      value: -0
      objectReference: {fileID: 0}
    - target: {fileID: 471166, guid: f4f6b630159e6b34386dec2579f250b2, type: 3}
      propertyPath: m_LocalRotation.y
      value: -0
      objectReference: {fileID: 0}
    - target: {fileID: 471166, guid: f4f6b630159e6b34386dec2579f250b2, type: 3}
      propertyPath: m_LocalRotation.z
      value: -0
      objectReference: {fileID: 0}
    - target: {fileID: 471166, guid: f4f6b630159e6b34386dec2579f250b2, type: 3}
      propertyPath: m_LocalRotation.w
      value: 1
      objectReference: {fileID: 0}
    - target: {fileID: 471166, guid: f4f6b630159e6b34386dec2579f250b2, type: 3}
      propertyPath: m_RootOrder
      value: 9
      objectReference: {fileID: 0}
    - target: {fileID: 471166, guid: f4f6b630159e6b34386dec2579f250b2, type: 3}
      propertyPath: m_LocalEulerAnglesHint.x
      value: 0
      objectReference: {fileID: 0}
    - target: {fileID: 471166, guid: f4f6b630159e6b34386dec2579f250b2, type: 3}
      propertyPath: m_LocalEulerAnglesHint.y
      value: 0
      objectReference: {fileID: 0}
    - target: {fileID: 471166, guid: f4f6b630159e6b34386dec2579f250b2, type: 3}
      propertyPath: m_LocalEulerAnglesHint.z
      value: 0
      objectReference: {fileID: 0}
    m_RemovedComponents: []
  m_SourcePrefab: {fileID: 100100000, guid: f4f6b630159e6b34386dec2579f250b2, type: 3}
--- !u!4 &346096084 stripped
Transform:
  m_CorrespondingSourceObject: {fileID: 471166, guid: f4f6b630159e6b34386dec2579f250b2,
    type: 3}
  m_PrefabInstance: {fileID: 1150527907}
  m_PrefabAsset: {fileID: 0}
--- !u!4 &358652606 stripped
Transform:
  m_CorrespondingSourceObject: {fileID: 471166, guid: f4f6b630159e6b34386dec2579f250b2,
    type: 3}
  m_PrefabInstance: {fileID: 1221682917}
  m_PrefabAsset: {fileID: 0}
--- !u!1001 &371156415
PrefabInstance:
  m_ObjectHideFlags: 0
  serializedVersion: 2
  m_Modification:
    m_TransformParent: {fileID: 1490319263}
    m_Modifications:
    - target: {fileID: 165880, guid: f4f6b630159e6b34386dec2579f250b2, type: 3}
      propertyPath: m_Name
      value: ETower 3 (1)
      objectReference: {fileID: 0}
    - target: {fileID: 471166, guid: f4f6b630159e6b34386dec2579f250b2, type: 3}
      propertyPath: m_LocalPosition.x
      value: 30.999998
      objectReference: {fileID: 0}
    - target: {fileID: 471166, guid: f4f6b630159e6b34386dec2579f250b2, type: 3}
      propertyPath: m_LocalPosition.y
      value: -59.179356
      objectReference: {fileID: 0}
    - target: {fileID: 471166, guid: f4f6b630159e6b34386dec2579f250b2, type: 3}
      propertyPath: m_LocalPosition.z
      value: 81.6
      objectReference: {fileID: 0}
    - target: {fileID: 471166, guid: f4f6b630159e6b34386dec2579f250b2, type: 3}
      propertyPath: m_LocalRotation.x
      value: -0
      objectReference: {fileID: 0}
    - target: {fileID: 471166, guid: f4f6b630159e6b34386dec2579f250b2, type: 3}
      propertyPath: m_LocalRotation.y
      value: -0
      objectReference: {fileID: 0}
    - target: {fileID: 471166, guid: f4f6b630159e6b34386dec2579f250b2, type: 3}
      propertyPath: m_LocalRotation.z
      value: -0
      objectReference: {fileID: 0}
    - target: {fileID: 471166, guid: f4f6b630159e6b34386dec2579f250b2, type: 3}
      propertyPath: m_LocalRotation.w
      value: 1
      objectReference: {fileID: 0}
    - target: {fileID: 471166, guid: f4f6b630159e6b34386dec2579f250b2, type: 3}
      propertyPath: m_RootOrder
      value: 6
      objectReference: {fileID: 0}
    - target: {fileID: 471166, guid: f4f6b630159e6b34386dec2579f250b2, type: 3}
      propertyPath: m_LocalEulerAnglesHint.x
      value: 0
      objectReference: {fileID: 0}
    - target: {fileID: 471166, guid: f4f6b630159e6b34386dec2579f250b2, type: 3}
      propertyPath: m_LocalEulerAnglesHint.y
      value: 0
      objectReference: {fileID: 0}
    - target: {fileID: 471166, guid: f4f6b630159e6b34386dec2579f250b2, type: 3}
      propertyPath: m_LocalEulerAnglesHint.z
      value: 0
      objectReference: {fileID: 0}
    m_RemovedComponents: []
  m_SourcePrefab: {fileID: 100100000, guid: f4f6b630159e6b34386dec2579f250b2, type: 3}
--- !u!4 &388932189 stripped
Transform:
  m_CorrespondingSourceObject: {fileID: 471166, guid: f4f6b630159e6b34386dec2579f250b2,
    type: 3}
  m_PrefabInstance: {fileID: 330424385}
  m_PrefabAsset: {fileID: 0}
--- !u!1001 &413329432
PrefabInstance:
  m_ObjectHideFlags: 0
  serializedVersion: 2
  m_Modification:
    m_TransformParent: {fileID: 1497094537}
    m_Modifications:
    - target: {fileID: 165880, guid: f4f6b630159e6b34386dec2579f250b2, type: 3}
      propertyPath: m_Name
      value: ETower 3 (2)
      objectReference: {fileID: 0}
    - target: {fileID: 471166, guid: f4f6b630159e6b34386dec2579f250b2, type: 3}
      propertyPath: m_LocalPosition.x
      value: 30.999998
      objectReference: {fileID: 0}
    - target: {fileID: 471166, guid: f4f6b630159e6b34386dec2579f250b2, type: 3}
      propertyPath: m_LocalPosition.y
      value: -59.179356
      objectReference: {fileID: 0}
    - target: {fileID: 471166, guid: f4f6b630159e6b34386dec2579f250b2, type: 3}
      propertyPath: m_LocalPosition.z
      value: -101.00001
      objectReference: {fileID: 0}
    - target: {fileID: 471166, guid: f4f6b630159e6b34386dec2579f250b2, type: 3}
      propertyPath: m_LocalRotation.x
      value: -0
      objectReference: {fileID: 0}
    - target: {fileID: 471166, guid: f4f6b630159e6b34386dec2579f250b2, type: 3}
      propertyPath: m_LocalRotation.y
      value: -0
      objectReference: {fileID: 0}
    - target: {fileID: 471166, guid: f4f6b630159e6b34386dec2579f250b2, type: 3}
      propertyPath: m_LocalRotation.z
      value: -0
      objectReference: {fileID: 0}
    - target: {fileID: 471166, guid: f4f6b630159e6b34386dec2579f250b2, type: 3}
      propertyPath: m_LocalRotation.w
      value: 1
      objectReference: {fileID: 0}
    - target: {fileID: 471166, guid: f4f6b630159e6b34386dec2579f250b2, type: 3}
      propertyPath: m_RootOrder
      value: 11
      objectReference: {fileID: 0}
    - target: {fileID: 471166, guid: f4f6b630159e6b34386dec2579f250b2, type: 3}
      propertyPath: m_LocalEulerAnglesHint.x
      value: 0
      objectReference: {fileID: 0}
    - target: {fileID: 471166, guid: f4f6b630159e6b34386dec2579f250b2, type: 3}
      propertyPath: m_LocalEulerAnglesHint.y
      value: 0
      objectReference: {fileID: 0}
    - target: {fileID: 471166, guid: f4f6b630159e6b34386dec2579f250b2, type: 3}
      propertyPath: m_LocalEulerAnglesHint.z
      value: 0
      objectReference: {fileID: 0}
    m_RemovedComponents: []
  m_SourcePrefab: {fileID: 100100000, guid: f4f6b630159e6b34386dec2579f250b2, type: 3}
--- !u!4 &517229518 stripped
Transform:
  m_CorrespondingSourceObject: {fileID: 471166, guid: f4f6b630159e6b34386dec2579f250b2,
    type: 3}
  m_PrefabInstance: {fileID: 1949650724}
  m_PrefabAsset: {fileID: 0}
--- !u!4 &522499360 stripped
Transform:
  m_CorrespondingSourceObject: {fileID: 471166, guid: f4f6b630159e6b34386dec2579f250b2,
    type: 3}
  m_PrefabInstance: {fileID: 128234882}
  m_PrefabAsset: {fileID: 0}
--- !u!4 &568552353 stripped
Transform:
  m_CorrespondingSourceObject: {fileID: 471166, guid: f4f6b630159e6b34386dec2579f250b2,
    type: 3}
  m_PrefabInstance: {fileID: 834393989}
  m_PrefabAsset: {fileID: 0}
--- !u!1 &705507993
GameObject:
  m_ObjectHideFlags: 0
  m_CorrespondingSourceObject: {fileID: 0}
  m_PrefabInstance: {fileID: 0}
  m_PrefabAsset: {fileID: 0}
  serializedVersion: 6
  m_Component:
  - component: {fileID: 705507995}
  - component: {fileID: 705507994}
  - component: {fileID: 705507996}
  m_Layer: 0
  m_Name: Directional Light
  m_TagString: Untagged
  m_Icon: {fileID: 0}
  m_NavMeshLayer: 0
  m_StaticEditorFlags: 0
  m_IsActive: 1
--- !u!108 &705507994
Light:
  m_ObjectHideFlags: 0
  m_CorrespondingSourceObject: {fileID: 0}
  m_PrefabInstance: {fileID: 0}
  m_PrefabAsset: {fileID: 0}
  m_GameObject: {fileID: 705507993}
  m_Enabled: 1
  serializedVersion: 10
  m_Type: 1
  m_Shape: 0
  m_Color: {r: 1, g: 0.95686275, b: 0.8392157, a: 1}
  m_Intensity: 1
  m_Range: 10
  m_SpotAngle: 30
  m_InnerSpotAngle: 21.80208
  m_CookieSize: 10
  m_Shadows:
    m_Type: 2
    m_Resolution: -1
    m_CustomResolution: -1
    m_Strength: 1
    m_Bias: 0.05
    m_NormalBias: 0.4
    m_NearPlane: 0.2
    m_CullingMatrixOverride:
      e00: 1
      e01: 0
      e02: 0
      e03: 0
      e10: 0
      e11: 1
      e12: 0
      e13: 0
      e20: 0
      e21: 0
      e22: 1
      e23: 0
      e30: 0
      e31: 0
      e32: 0
      e33: 1
    m_UseCullingMatrixOverride: 0
  m_Cookie: {fileID: 0}
  m_DrawHalo: 0
  m_Flare: {fileID: 0}
  m_RenderMode: 0
  m_CullingMask:
    serializedVersion: 2
    m_Bits: 4294967295
  m_RenderingLayerMask: 1
  m_Lightmapping: 1
  m_LightShadowCasterMode: 0
  m_AreaSize: {x: 1, y: 1}
  m_BounceIntensity: 1
  m_ColorTemperature: 6570
  m_UseColorTemperature: 0
  m_BoundingSphereOverride: {x: 0, y: 0, z: 0, w: 0}
  m_UseBoundingSphereOverride: 0
  m_ShadowRadius: 0
  m_ShadowAngle: 0
--- !u!4 &705507995
Transform:
  m_ObjectHideFlags: 0
  m_CorrespondingSourceObject: {fileID: 0}
  m_PrefabInstance: {fileID: 0}
  m_PrefabAsset: {fileID: 0}
  m_GameObject: {fileID: 705507993}
  m_LocalRotation: {x: 0.40821788, y: -0.23456968, z: 0.10938163, w: 0.8754261}
  m_LocalPosition: {x: 0, y: 3, z: 0}
  m_LocalScale: {x: 1, y: 1, z: 1}
  m_Children: []
  m_Father: {fileID: 0}
  m_RootOrder: 1
  m_LocalEulerAnglesHint: {x: 50, y: -30, z: 0}
--- !u!114 &705507996
MonoBehaviour:
  m_ObjectHideFlags: 0
  m_CorrespondingSourceObject: {fileID: 0}
  m_PrefabInstance: {fileID: 0}
  m_PrefabAsset: {fileID: 0}
  m_GameObject: {fileID: 705507993}
  m_Enabled: 1
  m_EditorHideFlags: 0
  m_Script: {fileID: 11500000, guid: 642f59ecdd0589f4c8d21f17e0e4a6e5, type: 3}
  m_Name: 
  m_EditorClassIdentifier: 
  lt: {fileID: 705507994}
  night: 0
  dayNightTimer: 2
--- !u!1001 &718945584
PrefabInstance:
  m_ObjectHideFlags: 0
  serializedVersion: 2
  m_Modification:
    m_TransformParent: {fileID: 0}
    m_Modifications:
    - target: {fileID: 108720, guid: 78e7e2f53bf0dbc43acdbdedb2a6a287, type: 3}
      propertyPath: m_Name
      value: Player
      objectReference: {fileID: 0}
    - target: {fileID: 408720, guid: 78e7e2f53bf0dbc43acdbdedb2a6a287, type: 3}
      propertyPath: m_LocalPosition.x
      value: 0
      objectReference: {fileID: 0}
    - target: {fileID: 408720, guid: 78e7e2f53bf0dbc43acdbdedb2a6a287, type: 3}
      propertyPath: m_LocalPosition.y
      value: 0
      objectReference: {fileID: 0}
    - target: {fileID: 408720, guid: 78e7e2f53bf0dbc43acdbdedb2a6a287, type: 3}
      propertyPath: m_LocalPosition.z
      value: 4.7
      objectReference: {fileID: 0}
    - target: {fileID: 408720, guid: 78e7e2f53bf0dbc43acdbdedb2a6a287, type: 3}
      propertyPath: m_LocalRotation.x
      value: 0
      objectReference: {fileID: 0}
    - target: {fileID: 408720, guid: 78e7e2f53bf0dbc43acdbdedb2a6a287, type: 3}
      propertyPath: m_LocalRotation.y
      value: 0
      objectReference: {fileID: 0}
    - target: {fileID: 408720, guid: 78e7e2f53bf0dbc43acdbdedb2a6a287, type: 3}
      propertyPath: m_LocalRotation.z
      value: 0
      objectReference: {fileID: 0}
    - target: {fileID: 408720, guid: 78e7e2f53bf0dbc43acdbdedb2a6a287, type: 3}
      propertyPath: m_LocalRotation.w
      value: 1
      objectReference: {fileID: 0}
    - target: {fileID: 408720, guid: 78e7e2f53bf0dbc43acdbdedb2a6a287, type: 3}
      propertyPath: m_RootOrder
      value: 0
      objectReference: {fileID: 0}
    - target: {fileID: 408720, guid: 78e7e2f53bf0dbc43acdbdedb2a6a287, type: 3}
      propertyPath: m_LocalEulerAnglesHint.x
      value: 0
      objectReference: {fileID: 0}
    - target: {fileID: 408720, guid: 78e7e2f53bf0dbc43acdbdedb2a6a287, type: 3}
      propertyPath: m_LocalEulerAnglesHint.y
      value: 0
      objectReference: {fileID: 0}
    - target: {fileID: 408720, guid: 78e7e2f53bf0dbc43acdbdedb2a6a287, type: 3}
      propertyPath: m_LocalEulerAnglesHint.z
      value: 0
      objectReference: {fileID: 0}
    m_RemovedComponents: []
  m_SourcePrefab: {fileID: 100100000, guid: 78e7e2f53bf0dbc43acdbdedb2a6a287, type: 3}
--- !u!1001 &834393989
PrefabInstance:
  m_ObjectHideFlags: 0
  serializedVersion: 2
  m_Modification:
    m_TransformParent: {fileID: 1490319263}
    m_Modifications:
    - target: {fileID: 165880, guid: f4f6b630159e6b34386dec2579f250b2, type: 3}
      propertyPath: m_Name
      value: ETower 1
      objectReference: {fileID: 0}
    - target: {fileID: 471166, guid: f4f6b630159e6b34386dec2579f250b2, type: 3}
      propertyPath: m_LocalPosition.x
      value: -13.2
      objectReference: {fileID: 0}
    - target: {fileID: 471166, guid: f4f6b630159e6b34386dec2579f250b2, type: 3}
      propertyPath: m_LocalPosition.y
      value: -59.179356
      objectReference: {fileID: 0}
    - target: {fileID: 471166, guid: f4f6b630159e6b34386dec2579f250b2, type: 3}
      propertyPath: m_LocalPosition.z
      value: -18.1
      objectReference: {fileID: 0}
    - target: {fileID: 471166, guid: f4f6b630159e6b34386dec2579f250b2, type: 3}
      propertyPath: m_LocalRotation.x
      value: -0
      objectReference: {fileID: 0}
    - target: {fileID: 471166, guid: f4f6b630159e6b34386dec2579f250b2, type: 3}
      propertyPath: m_LocalRotation.y
      value: -0
      objectReference: {fileID: 0}
    - target: {fileID: 471166, guid: f4f6b630159e6b34386dec2579f250b2, type: 3}
      propertyPath: m_LocalRotation.z
      value: -0
      objectReference: {fileID: 0}
    - target: {fileID: 471166, guid: f4f6b630159e6b34386dec2579f250b2, type: 3}
      propertyPath: m_LocalRotation.w
      value: 1
      objectReference: {fileID: 0}
    - target: {fileID: 471166, guid: f4f6b630159e6b34386dec2579f250b2, type: 3}
      propertyPath: m_RootOrder
      value: 1
      objectReference: {fileID: 0}
    - target: {fileID: 471166, guid: f4f6b630159e6b34386dec2579f250b2, type: 3}
      propertyPath: m_LocalEulerAnglesHint.x
      value: 0
      objectReference: {fileID: 0}
    - target: {fileID: 471166, guid: f4f6b630159e6b34386dec2579f250b2, type: 3}
      propertyPath: m_LocalEulerAnglesHint.y
      value: 0
      objectReference: {fileID: 0}
    - target: {fileID: 471166, guid: f4f6b630159e6b34386dec2579f250b2, type: 3}
      propertyPath: m_LocalEulerAnglesHint.z
      value: 0
      objectReference: {fileID: 0}
    m_RemovedComponents: []
  m_SourcePrefab: {fileID: 100100000, guid: f4f6b630159e6b34386dec2579f250b2, type: 3}
--- !u!1001 &835158233
PrefabInstance:
  m_ObjectHideFlags: 0
  serializedVersion: 2
  m_Modification:
    m_TransformParent: {fileID: 1490319263}
    m_Modifications:
    - target: {fileID: 165880, guid: f4f6b630159e6b34386dec2579f250b2, type: 3}
      propertyPath: m_Name
      value: ETower 3 (2)
      objectReference: {fileID: 0}
    - target: {fileID: 471166, guid: f4f6b630159e6b34386dec2579f250b2, type: 3}
      propertyPath: m_LocalPosition.x
      value: 30.999998
      objectReference: {fileID: 0}
    - target: {fileID: 471166, guid: f4f6b630159e6b34386dec2579f250b2, type: 3}
      propertyPath: m_LocalPosition.y
      value: -59.179356
      objectReference: {fileID: 0}
    - target: {fileID: 471166, guid: f4f6b630159e6b34386dec2579f250b2, type: 3}
      propertyPath: m_LocalPosition.z
      value: -114.1
      objectReference: {fileID: 0}
    - target: {fileID: 471166, guid: f4f6b630159e6b34386dec2579f250b2, type: 3}
      propertyPath: m_LocalRotation.x
      value: -0
      objectReference: {fileID: 0}
    - target: {fileID: 471166, guid: f4f6b630159e6b34386dec2579f250b2, type: 3}
      propertyPath: m_LocalRotation.y
      value: -0
      objectReference: {fileID: 0}
    - target: {fileID: 471166, guid: f4f6b630159e6b34386dec2579f250b2, type: 3}
      propertyPath: m_LocalRotation.z
      value: -0
      objectReference: {fileID: 0}
    - target: {fileID: 471166, guid: f4f6b630159e6b34386dec2579f250b2, type: 3}
      propertyPath: m_LocalRotation.w
      value: 1
      objectReference: {fileID: 0}
    - target: {fileID: 471166, guid: f4f6b630159e6b34386dec2579f250b2, type: 3}
      propertyPath: m_RootOrder
      value: 10
      objectReference: {fileID: 0}
    - target: {fileID: 471166, guid: f4f6b630159e6b34386dec2579f250b2, type: 3}
      propertyPath: m_LocalEulerAnglesHint.x
      value: 0
      objectReference: {fileID: 0}
    - target: {fileID: 471166, guid: f4f6b630159e6b34386dec2579f250b2, type: 3}
      propertyPath: m_LocalEulerAnglesHint.y
      value: 0
      objectReference: {fileID: 0}
    - target: {fileID: 471166, guid: f4f6b630159e6b34386dec2579f250b2, type: 3}
      propertyPath: m_LocalEulerAnglesHint.z
      value: 0
      objectReference: {fileID: 0}
    m_RemovedComponents: []
  m_SourcePrefab: {fileID: 100100000, guid: f4f6b630159e6b34386dec2579f250b2, type: 3}
--- !u!1 &875264199
GameObject:
  m_ObjectHideFlags: 0
  m_CorrespondingSourceObject: {fileID: 0}
  m_PrefabInstance: {fileID: 0}
  m_PrefabAsset: {fileID: 0}
  serializedVersion: 6
  m_Component:
  - component: {fileID: 875264200}
  - component: {fileID: 875264201}
  m_Layer: 0
  m_Name: Cam
  m_TagString: Untagged
  m_Icon: {fileID: 0}
  m_NavMeshLayer: 0
  m_StaticEditorFlags: 0
  m_IsActive: 1
--- !u!4 &875264200
Transform:
  m_ObjectHideFlags: 0
  m_CorrespondingSourceObject: {fileID: 0}
  m_PrefabInstance: {fileID: 0}
  m_PrefabAsset: {fileID: 0}
  m_GameObject: {fileID: 875264199}
  m_LocalRotation: {x: 0, y: 0, z: 0, w: 1}
  m_LocalPosition: {x: 0, y: 0, z: 0}
  m_LocalScale: {x: 1, y: 1, z: 1}
  m_Children:
  - {fileID: 963194228}
  m_Father: {fileID: 0}
  m_RootOrder: 4
  m_LocalEulerAnglesHint: {x: 0, y: 0, z: 0}
--- !u!114 &875264201
MonoBehaviour:
  m_ObjectHideFlags: 0
  m_CorrespondingSourceObject: {fileID: 0}
  m_PrefabInstance: {fileID: 0}
  m_PrefabAsset: {fileID: 0}
  m_GameObject: {fileID: 875264199}
  m_Enabled: 1
  m_EditorHideFlags: 0
  m_Script: {fileID: 11500000, guid: 9ffa801272ac95d44bd67bd4ce19c2b0, type: 3}
  m_Name: 
  m_EditorClassIdentifier: 
  panSpeed: 20
  boarderPixCount: 10
  panLimit: {x: 120, y: 120}
--- !u!4 &962974405 stripped
Transform:
  m_CorrespondingSourceObject: {fileID: 471166, guid: f4f6b630159e6b34386dec2579f250b2,
    type: 3}
  m_PrefabInstance: {fileID: 2025539626}
  m_PrefabAsset: {fileID: 0}
--- !u!1 &963194225
GameObject:
  m_ObjectHideFlags: 0
  m_CorrespondingSourceObject: {fileID: 0}
  m_PrefabInstance: {fileID: 0}
  m_PrefabAsset: {fileID: 0}
  serializedVersion: 6
  m_Component:
  - component: {fileID: 963194228}
  - component: {fileID: 963194227}
  - component: {fileID: 963194226}
  m_Layer: 0
  m_Name: Main Camera
  m_TagString: MainCamera
  m_Icon: {fileID: 0}
  m_NavMeshLayer: 0
  m_StaticEditorFlags: 0
  m_IsActive: 1
--- !u!81 &963194226
AudioListener:
  m_ObjectHideFlags: 0
  m_CorrespondingSourceObject: {fileID: 0}
  m_PrefabInstance: {fileID: 0}
  m_PrefabAsset: {fileID: 0}
  m_GameObject: {fileID: 963194225}
  m_Enabled: 1
--- !u!20 &963194227
Camera:
  m_ObjectHideFlags: 0
  m_CorrespondingSourceObject: {fileID: 0}
  m_PrefabInstance: {fileID: 0}
  m_PrefabAsset: {fileID: 0}
  m_GameObject: {fileID: 963194225}
  m_Enabled: 1
  serializedVersion: 2
  m_ClearFlags: 1
  m_BackGroundColor: {r: 0.19215687, g: 0.3019608, b: 0.4745098, a: 0}
  m_projectionMatrixMode: 1
  m_GateFitMode: 2
  m_FOVAxisMode: 0
  m_SensorSize: {x: 36, y: 24}
  m_LensShift: {x: 0, y: 0}
  m_FocalLength: 50
  m_NormalizedViewPortRect:
    serializedVersion: 2
    x: 0
    y: 0
    width: 1
    height: 1
  near clip plane: 0.3
  far clip plane: 1000
  field of view: 40
  orthographic: 0
  orthographic size: 5
  m_Depth: -1
  m_CullingMask:
    serializedVersion: 2
    m_Bits: 4294967295
  m_RenderingPath: -1
  m_TargetTexture: {fileID: 0}
  m_TargetDisplay: 0
  m_TargetEye: 3
  m_HDR: 1
  m_AllowMSAA: 1
  m_AllowDynamicResolution: 0
  m_ForceIntoRT: 0
  m_OcclusionCulling: 1
  m_StereoConvergence: 10
  m_StereoSeparation: 0.022
--- !u!4 &963194228
Transform:
  m_ObjectHideFlags: 0
  m_CorrespondingSourceObject: {fileID: 0}
  m_PrefabInstance: {fileID: 0}
  m_PrefabAsset: {fileID: 0}
  m_GameObject: {fileID: 963194225}
  m_LocalRotation: {x: 0.43961662, y: 0.41256723, z: -0.2381958, w: 0.7614383}
  m_LocalPosition: {x: -31.95, y: 67.8, z: -15.8}
  m_LocalScale: {x: 1, y: 1, z: 1}
  m_Children: []
  m_Father: {fileID: 875264200}
  m_RootOrder: 0
  m_LocalEulerAnglesHint: {x: 60, y: 56.9, z: 0}
--- !u!1001 &994432591
PrefabInstance:
  m_ObjectHideFlags: 0
  serializedVersion: 2
  m_Modification:
    m_TransformParent: {fileID: 1497094537}
    m_Modifications:
    - target: {fileID: 165880, guid: f4f6b630159e6b34386dec2579f250b2, type: 3}
      propertyPath: m_Name
      value: ETower 1 (2)
      objectReference: {fileID: 0}
    - target: {fileID: 471166, guid: f4f6b630159e6b34386dec2579f250b2, type: 3}
      propertyPath: m_LocalPosition.x
      value: 2.6
      objectReference: {fileID: 0}
    - target: {fileID: 471166, guid: f4f6b630159e6b34386dec2579f250b2, type: 3}
      propertyPath: m_LocalPosition.y
      value: -59.179356
      objectReference: {fileID: 0}
    - target: {fileID: 471166, guid: f4f6b630159e6b34386dec2579f250b2, type: 3}
      propertyPath: m_LocalPosition.z
      value: -101
      objectReference: {fileID: 0}
    - target: {fileID: 471166, guid: f4f6b630159e6b34386dec2579f250b2, type: 3}
      propertyPath: m_LocalRotation.x
      value: -0
      objectReference: {fileID: 0}
    - target: {fileID: 471166, guid: f4f6b630159e6b34386dec2579f250b2, type: 3}
      propertyPath: m_LocalRotation.y
      value: -0
      objectReference: {fileID: 0}
    - target: {fileID: 471166, guid: f4f6b630159e6b34386dec2579f250b2, type: 3}
      propertyPath: m_LocalRotation.z
      value: -0
      objectReference: {fileID: 0}
    - target: {fileID: 471166, guid: f4f6b630159e6b34386dec2579f250b2, type: 3}
      propertyPath: m_LocalRotation.w
      value: 1
      objectReference: {fileID: 0}
    - target: {fileID: 471166, guid: f4f6b630159e6b34386dec2579f250b2, type: 3}
      propertyPath: m_RootOrder
      value: 9
      objectReference: {fileID: 0}
    - target: {fileID: 471166, guid: f4f6b630159e6b34386dec2579f250b2, type: 3}
      propertyPath: m_LocalEulerAnglesHint.x
      value: 0
      objectReference: {fileID: 0}
    - target: {fileID: 471166, guid: f4f6b630159e6b34386dec2579f250b2, type: 3}
      propertyPath: m_LocalEulerAnglesHint.y
      value: 0
      objectReference: {fileID: 0}
    - target: {fileID: 471166, guid: f4f6b630159e6b34386dec2579f250b2, type: 3}
      propertyPath: m_LocalEulerAnglesHint.z
      value: 0
      objectReference: {fileID: 0}
    m_RemovedComponents: []
  m_SourcePrefab: {fileID: 100100000, guid: f4f6b630159e6b34386dec2579f250b2, type: 3}
--- !u!1 &1015049537
GameObject:
  m_ObjectHideFlags: 0
  m_CorrespondingSourceObject: {fileID: 0}
  m_PrefabInstance: {fileID: 0}
  m_PrefabAsset: {fileID: 0}
  serializedVersion: 6
  m_Component:
  - component: {fileID: 1015049541}
  - component: {fileID: 1015049540}
  - component: {fileID: 1015049539}
  - component: {fileID: 1015049538}
  m_Layer: 0
  m_Name: Plane
  m_TagString: Untagged
  m_Icon: {fileID: 0}
  m_NavMeshLayer: 0
  m_StaticEditorFlags: 0
  m_IsActive: 1
--- !u!64 &1015049538
MeshCollider:
  m_ObjectHideFlags: 0
  m_CorrespondingSourceObject: {fileID: 0}
  m_PrefabInstance: {fileID: 0}
  m_PrefabAsset: {fileID: 0}
  m_GameObject: {fileID: 1015049537}
  m_Material: {fileID: 0}
  m_IsTrigger: 0
  m_Enabled: 1
  serializedVersion: 4
  m_Convex: 0
  m_CookingOptions: 30
  m_Mesh: {fileID: 10209, guid: 0000000000000000e000000000000000, type: 0}
--- !u!23 &1015049539
MeshRenderer:
  m_ObjectHideFlags: 0
  m_CorrespondingSourceObject: {fileID: 0}
  m_PrefabInstance: {fileID: 0}
  m_PrefabAsset: {fileID: 0}
  m_GameObject: {fileID: 1015049537}
  m_Enabled: 1
  m_CastShadows: 1
  m_ReceiveShadows: 1
  m_DynamicOccludee: 1
  m_MotionVectors: 1
  m_LightProbeUsage: 1
  m_ReflectionProbeUsage: 1
  m_RayTracingMode: 2
  m_RenderingLayerMask: 1
  m_RendererPriority: 0
  m_Materials:
  - {fileID: 10303, guid: 0000000000000000f000000000000000, type: 0}
  m_StaticBatchInfo:
    firstSubMesh: 0
    subMeshCount: 0
  m_StaticBatchRoot: {fileID: 0}
  m_ProbeAnchor: {fileID: 0}
  m_LightProbeVolumeOverride: {fileID: 0}
  m_ScaleInLightmap: 1
  m_ReceiveGI: 1
  m_PreserveUVs: 0
  m_IgnoreNormalsForChartDetection: 0
  m_ImportantGI: 0
  m_StitchLightmapSeams: 1
  m_SelectedEditorRenderState: 3
  m_MinimumChartSize: 4
  m_AutoUVMaxDistance: 0.5
  m_AutoUVMaxAngle: 89
  m_LightmapParameters: {fileID: 0}
  m_SortingLayerID: 0
  m_SortingLayer: 0
  m_SortingOrder: 0
--- !u!33 &1015049540
MeshFilter:
  m_ObjectHideFlags: 0
  m_CorrespondingSourceObject: {fileID: 0}
  m_PrefabInstance: {fileID: 0}
  m_PrefabAsset: {fileID: 0}
  m_GameObject: {fileID: 1015049537}
  m_Mesh: {fileID: 10209, guid: 0000000000000000e000000000000000, type: 0}
--- !u!4 &1015049541
Transform:
  m_ObjectHideFlags: 0
  m_CorrespondingSourceObject: {fileID: 0}
  m_PrefabInstance: {fileID: 0}
  m_PrefabAsset: {fileID: 0}
  m_GameObject: {fileID: 1015049537}
  m_LocalRotation: {x: 0, y: 0, z: 0, w: 1}
  m_LocalPosition: {x: 0, y: 0, z: 0}
  m_LocalScale: {x: 30, y: 1, z: 30}
  m_Children: []
  m_Father: {fileID: 0}
  m_RootOrder: 2
  m_LocalEulerAnglesHint: {x: 0, y: 0, z: 0}
--- !u!1001 &1068588842
PrefabInstance:
  m_ObjectHideFlags: 0
  serializedVersion: 2
  m_Modification:
    m_TransformParent: {fileID: 1497094537}
    m_Modifications:
    - target: {fileID: 165880, guid: f4f6b630159e6b34386dec2579f250b2, type: 3}
      propertyPath: m_Name
      value: ETower 3 (1)
      objectReference: {fileID: 0}
    - target: {fileID: 471166, guid: f4f6b630159e6b34386dec2579f250b2, type: 3}
      propertyPath: m_LocalPosition.x
      value: 30.999998
      objectReference: {fileID: 0}
    - target: {fileID: 471166, guid: f4f6b630159e6b34386dec2579f250b2, type: 3}
      propertyPath: m_LocalPosition.y
      value: -59.179356
      objectReference: {fileID: 0}
    - target: {fileID: 471166, guid: f4f6b630159e6b34386dec2579f250b2, type: 3}
      propertyPath: m_LocalPosition.z
      value: 94.7
      objectReference: {fileID: 0}
    - target: {fileID: 471166, guid: f4f6b630159e6b34386dec2579f250b2, type: 3}
      propertyPath: m_LocalRotation.x
      value: -0
      objectReference: {fileID: 0}
    - target: {fileID: 471166, guid: f4f6b630159e6b34386dec2579f250b2, type: 3}
      propertyPath: m_LocalRotation.y
      value: -0
      objectReference: {fileID: 0}
    - target: {fileID: 471166, guid: f4f6b630159e6b34386dec2579f250b2, type: 3}
      propertyPath: m_LocalRotation.z
      value: -0
      objectReference: {fileID: 0}
    - target: {fileID: 471166, guid: f4f6b630159e6b34386dec2579f250b2, type: 3}
      propertyPath: m_LocalRotation.w
      value: 1
      objectReference: {fileID: 0}
    - target: {fileID: 471166, guid: f4f6b630159e6b34386dec2579f250b2, type: 3}
      propertyPath: m_RootOrder
      value: 6
      objectReference: {fileID: 0}
    - target: {fileID: 471166, guid: f4f6b630159e6b34386dec2579f250b2, type: 3}
      propertyPath: m_LocalEulerAnglesHint.x
      value: 0
      objectReference: {fileID: 0}
    - target: {fileID: 471166, guid: f4f6b630159e6b34386dec2579f250b2, type: 3}
      propertyPath: m_LocalEulerAnglesHint.y
      value: 0
      objectReference: {fileID: 0}
    - target: {fileID: 471166, guid: f4f6b630159e6b34386dec2579f250b2, type: 3}
      propertyPath: m_LocalEulerAnglesHint.z
      value: 0
      objectReference: {fileID: 0}
    m_RemovedComponents: []
  m_SourcePrefab: {fileID: 100100000, guid: f4f6b630159e6b34386dec2579f250b2, type: 3}
--- !u!1001 &1148221754
PrefabInstance:
  m_ObjectHideFlags: 0
  serializedVersion: 2
  m_Modification:
    m_TransformParent: {fileID: 1490319263}
    m_Modifications:
    - target: {fileID: 165880, guid: f4f6b630159e6b34386dec2579f250b2, type: 3}
      propertyPath: m_Name
      value: ETower 1 (2)
      objectReference: {fileID: 0}
    - target: {fileID: 471166, guid: f4f6b630159e6b34386dec2579f250b2, type: 3}
      propertyPath: m_LocalPosition.x
      value: 2.6
      objectReference: {fileID: 0}
    - target: {fileID: 471166, guid: f4f6b630159e6b34386dec2579f250b2, type: 3}
      propertyPath: m_LocalPosition.y
      value: -59.179356
      objectReference: {fileID: 0}
    - target: {fileID: 471166, guid: f4f6b630159e6b34386dec2579f250b2, type: 3}
      propertyPath: m_LocalPosition.z
      value: -114.1
      objectReference: {fileID: 0}
    - target: {fileID: 471166, guid: f4f6b630159e6b34386dec2579f250b2, type: 3}
      propertyPath: m_LocalRotation.x
      value: -0
      objectReference: {fileID: 0}
    - target: {fileID: 471166, guid: f4f6b630159e6b34386dec2579f250b2, type: 3}
      propertyPath: m_LocalRotation.y
      value: -0
      objectReference: {fileID: 0}
    - target: {fileID: 471166, guid: f4f6b630159e6b34386dec2579f250b2, type: 3}
      propertyPath: m_LocalRotation.z
      value: -0
      objectReference: {fileID: 0}
    - target: {fileID: 471166, guid: f4f6b630159e6b34386dec2579f250b2, type: 3}
      propertyPath: m_LocalRotation.w
      value: 1
      objectReference: {fileID: 0}
    - target: {fileID: 471166, guid: f4f6b630159e6b34386dec2579f250b2, type: 3}
      propertyPath: m_RootOrder
      value: 8
      objectReference: {fileID: 0}
    - target: {fileID: 471166, guid: f4f6b630159e6b34386dec2579f250b2, type: 3}
      propertyPath: m_LocalEulerAnglesHint.x
      value: 0
      objectReference: {fileID: 0}
    - target: {fileID: 471166, guid: f4f6b630159e6b34386dec2579f250b2, type: 3}
      propertyPath: m_LocalEulerAnglesHint.y
      value: 0
      objectReference: {fileID: 0}
    - target: {fileID: 471166, guid: f4f6b630159e6b34386dec2579f250b2, type: 3}
      propertyPath: m_LocalEulerAnglesHint.z
      value: 0
      objectReference: {fileID: 0}
    m_RemovedComponents: []
  m_SourcePrefab: {fileID: 100100000, guid: f4f6b630159e6b34386dec2579f250b2, type: 3}
--- !u!1001 &1150527907
PrefabInstance:
  m_ObjectHideFlags: 0
  serializedVersion: 2
  m_Modification:
    m_TransformParent: {fileID: 1497094537}
    m_Modifications:
    - target: {fileID: 165880, guid: f4f6b630159e6b34386dec2579f250b2, type: 3}
      propertyPath: m_Name
      value: ETower
      objectReference: {fileID: 0}
    - target: {fileID: 471166, guid: f4f6b630159e6b34386dec2579f250b2, type: 3}
      propertyPath: m_LocalPosition.x
      value: -19.160828
      objectReference: {fileID: 0}
    - target: {fileID: 471166, guid: f4f6b630159e6b34386dec2579f250b2, type: 3}
      propertyPath: m_LocalPosition.y
      value: -59.179356
      objectReference: {fileID: 0}
    - target: {fileID: 471166, guid: f4f6b630159e6b34386dec2579f250b2, type: 3}
      propertyPath: m_LocalPosition.z
      value: -2.332205
      objectReference: {fileID: 0}
    - target: {fileID: 471166, guid: f4f6b630159e6b34386dec2579f250b2, type: 3}
      propertyPath: m_LocalRotation.x
      value: -0
      objectReference: {fileID: 0}
    - target: {fileID: 471166, guid: f4f6b630159e6b34386dec2579f250b2, type: 3}
      propertyPath: m_LocalRotation.y
      value: -0
      objectReference: {fileID: 0}
    - target: {fileID: 471166, guid: f4f6b630159e6b34386dec2579f250b2, type: 3}
      propertyPath: m_LocalRotation.z
      value: -0
      objectReference: {fileID: 0}
    - target: {fileID: 471166, guid: f4f6b630159e6b34386dec2579f250b2, type: 3}
      propertyPath: m_LocalRotation.w
      value: 1
      objectReference: {fileID: 0}
    - target: {fileID: 471166, guid: f4f6b630159e6b34386dec2579f250b2, type: 3}
      propertyPath: m_RootOrder
      value: 0
      objectReference: {fileID: 0}
    - target: {fileID: 471166, guid: f4f6b630159e6b34386dec2579f250b2, type: 3}
      propertyPath: m_LocalEulerAnglesHint.x
      value: 0
      objectReference: {fileID: 0}
    - target: {fileID: 471166, guid: f4f6b630159e6b34386dec2579f250b2, type: 3}
      propertyPath: m_LocalEulerAnglesHint.y
      value: 0
      objectReference: {fileID: 0}
    - target: {fileID: 471166, guid: f4f6b630159e6b34386dec2579f250b2, type: 3}
      propertyPath: m_LocalEulerAnglesHint.z
      value: 0
      objectReference: {fileID: 0}
    m_RemovedComponents: []
  m_SourcePrefab: {fileID: 100100000, guid: f4f6b630159e6b34386dec2579f250b2, type: 3}
--- !u!4 &1205211599 stripped
Transform:
  m_CorrespondingSourceObject: {fileID: 471166, guid: f4f6b630159e6b34386dec2579f250b2,
    type: 3}
  m_PrefabInstance: {fileID: 1653513577}
  m_PrefabAsset: {fileID: 0}
--- !u!1001 &1221682917
PrefabInstance:
  m_ObjectHideFlags: 0
  serializedVersion: 2
  m_Modification:
    m_TransformParent: {fileID: 1497094537}
    m_Modifications:
    - target: {fileID: 165880, guid: f4f6b630159e6b34386dec2579f250b2, type: 3}
      propertyPath: m_Name
      value: ETower 3
      objectReference: {fileID: 0}
    - target: {fileID: 471166, guid: f4f6b630159e6b34386dec2579f250b2, type: 3}
      propertyPath: m_LocalPosition.x
      value: 30.999998
      objectReference: {fileID: 0}
    - target: {fileID: 471166, guid: f4f6b630159e6b34386dec2579f250b2, type: 3}
      propertyPath: m_LocalPosition.y
      value: -59.179356
      objectReference: {fileID: 0}
    - target: {fileID: 471166, guid: f4f6b630159e6b34386dec2579f250b2, type: 3}
      propertyPath: m_LocalPosition.z
      value: -2.332205
      objectReference: {fileID: 0}
    - target: {fileID: 471166, guid: f4f6b630159e6b34386dec2579f250b2, type: 3}
      propertyPath: m_LocalRotation.x
      value: -0
      objectReference: {fileID: 0}
    - target: {fileID: 471166, guid: f4f6b630159e6b34386dec2579f250b2, type: 3}
      propertyPath: m_LocalRotation.y
      value: -0
      objectReference: {fileID: 0}
    - target: {fileID: 471166, guid: f4f6b630159e6b34386dec2579f250b2, type: 3}
      propertyPath: m_LocalRotation.z
      value: -0
      objectReference: {fileID: 0}
    - target: {fileID: 471166, guid: f4f6b630159e6b34386dec2579f250b2, type: 3}
      propertyPath: m_LocalRotation.w
      value: 1
      objectReference: {fileID: 0}
    - target: {fileID: 471166, guid: f4f6b630159e6b34386dec2579f250b2, type: 3}
      propertyPath: m_RootOrder
      value: 3
      objectReference: {fileID: 0}
    - target: {fileID: 471166, guid: f4f6b630159e6b34386dec2579f250b2, type: 3}
      propertyPath: m_LocalEulerAnglesHint.x
      value: 0
      objectReference: {fileID: 0}
    - target: {fileID: 471166, guid: f4f6b630159e6b34386dec2579f250b2, type: 3}
      propertyPath: m_LocalEulerAnglesHint.y
      value: 0
      objectReference: {fileID: 0}
    - target: {fileID: 471166, guid: f4f6b630159e6b34386dec2579f250b2, type: 3}
      propertyPath: m_LocalEulerAnglesHint.z
      value: 0
      objectReference: {fileID: 0}
    m_RemovedComponents: []
  m_SourcePrefab: {fileID: 100100000, guid: f4f6b630159e6b34386dec2579f250b2, type: 3}
--- !u!4 &1255450253 stripped
Transform:
  m_CorrespondingSourceObject: {fileID: 471166, guid: f4f6b630159e6b34386dec2579f250b2,
    type: 3}
  m_PrefabInstance: {fileID: 1068588842}
  m_PrefabAsset: {fileID: 0}
--- !u!4 &1380286611 stripped
Transform:
  m_CorrespondingSourceObject: {fileID: 471166, guid: f4f6b630159e6b34386dec2579f250b2,
    type: 3}
  m_PrefabInstance: {fileID: 413329432}
  m_PrefabAsset: {fileID: 0}
--- !u!4 &1433153949 stripped
Transform:
  m_CorrespondingSourceObject: {fileID: 471166, guid: f4f6b630159e6b34386dec2579f250b2,
    type: 3}
  m_PrefabInstance: {fileID: 1924900281}
  m_PrefabAsset: {fileID: 0}
--- !u!1 &1490319262
GameObject:
  m_ObjectHideFlags: 0
  m_CorrespondingSourceObject: {fileID: 0}
  m_PrefabInstance: {fileID: 0}
  m_PrefabAsset: {fileID: 0}
  serializedVersion: 6
  m_Component:
  - component: {fileID: 1490319263}
  m_Layer: 0
  m_Name: EnemyTower (1)
  m_TagString: Untagged
  m_Icon: {fileID: 0}
  m_NavMeshLayer: 0
  m_StaticEditorFlags: 0
  m_IsActive: 1
--- !u!4 &1490319263
Transform:
  m_ObjectHideFlags: 0
  m_CorrespondingSourceObject: {fileID: 0}
  m_PrefabInstance: {fileID: 0}
  m_PrefabAsset: {fileID: 0}
  m_GameObject: {fileID: 1490319262}
  m_LocalRotation: {x: 0, y: 1, z: 0, w: 0}
  m_LocalPosition: {x: -58.1, y: 59.179356, z: -22.5}
  m_LocalScale: {x: 1, y: 1, z: 1}
  m_Children:
  - {fileID: 962974405}
  - {fileID: 568552353}
  - {fileID: 1205211599}
  - {fileID: 1433153949}
  - {fileID: 328736071}
  - {fileID: 1506561079}
  - {fileID: 1856375211}
  - {fileID: 1946396783}
  - {fileID: 2069975943}
  - {fileID: 517229518}
  - {fileID: 2079019602}
  m_Father: {fileID: 0}
  m_RootOrder: 5
  m_LocalEulerAnglesHint: {x: 0, y: 180, z: 0}
--- !u!1 &1497094536
GameObject:
  m_ObjectHideFlags: 0
  m_CorrespondingSourceObject: {fileID: 0}
  m_PrefabInstance: {fileID: 0}
  m_PrefabAsset: {fileID: 0}
  serializedVersion: 6
  m_Component:
  - component: {fileID: 1497094537}
  m_Layer: 0
  m_Name: EnemyTower
  m_TagString: Untagged
  m_Icon: {fileID: 0}
  m_NavMeshLayer: 0
  m_StaticEditorFlags: 0
  m_IsActive: 1
--- !u!4 &1497094537
Transform:
  m_ObjectHideFlags: 0
  m_CorrespondingSourceObject: {fileID: 0}
  m_PrefabInstance: {fileID: 0}
  m_PrefabAsset: {fileID: 0}
  m_GameObject: {fileID: 1497094536}
  m_LocalRotation: {x: 0, y: 0, z: 0, w: 1}
  m_LocalPosition: {x: 44.660824, y: 59.179356, z: -2.7677948}
  m_LocalScale: {x: 1, y: 1, z: 1}
  m_Children:
  - {fileID: 346096084}
  - {fileID: 1681970694}
  - {fileID: 358652606}
  - {fileID: 522499360}
  - {fileID: 1566173793}
  - {fileID: 181631808}
  - {fileID: 1255450253}
  - {fileID: 330329014}
  - {fileID: 388932189}
  - {fileID: 1967898068}
  - {fileID: 1380286611}
  m_Father: {fileID: 0}
  m_RootOrder: 3
  m_LocalEulerAnglesHint: {x: 0, y: 0, z: 0}
--- !u!1001 &1499962121
PrefabInstance:
  m_ObjectHideFlags: 0
  serializedVersion: 2
  m_Modification:
    m_TransformParent: {fileID: 1497094537}
    m_Modifications:
    - target: {fileID: 165880, guid: f4f6b630159e6b34386dec2579f250b2, type: 3}
      propertyPath: m_Name
      value: ETower 2 (1)
      objectReference: {fileID: 0}
    - target: {fileID: 471166, guid: f4f6b630159e6b34386dec2579f250b2, type: 3}
      propertyPath: m_LocalPosition.x
      value: 64.7
      objectReference: {fileID: 0}
    - target: {fileID: 471166, guid: f4f6b630159e6b34386dec2579f250b2, type: 3}
      propertyPath: m_LocalPosition.y
      value: -59.179356
      objectReference: {fileID: 0}
    - target: {fileID: 471166, guid: f4f6b630159e6b34386dec2579f250b2, type: 3}
      propertyPath: m_LocalPosition.z
      value: 12.5
      objectReference: {fileID: 0}
    - target: {fileID: 471166, guid: f4f6b630159e6b34386dec2579f250b2, type: 3}
      propertyPath: m_LocalRotation.x
      value: -0
      objectReference: {fileID: 0}
    - target: {fileID: 471166, guid: f4f6b630159e6b34386dec2579f250b2, type: 3}
      propertyPath: m_LocalRotation.y
      value: -0
      objectReference: {fileID: 0}
    - target: {fileID: 471166, guid: f4f6b630159e6b34386dec2579f250b2, type: 3}
      propertyPath: m_LocalRotation.z
      value: -0
      objectReference: {fileID: 0}
    - target: {fileID: 471166, guid: f4f6b630159e6b34386dec2579f250b2, type: 3}
      propertyPath: m_LocalRotation.w
      value: 1
      objectReference: {fileID: 0}
    - target: {fileID: 471166, guid: f4f6b630159e6b34386dec2579f250b2, type: 3}
      propertyPath: m_RootOrder
      value: 6
      objectReference: {fileID: 0}
    - target: {fileID: 471166, guid: f4f6b630159e6b34386dec2579f250b2, type: 3}
      propertyPath: m_LocalEulerAnglesHint.x
      value: 0
      objectReference: {fileID: 0}
    - target: {fileID: 471166, guid: f4f6b630159e6b34386dec2579f250b2, type: 3}
      propertyPath: m_LocalEulerAnglesHint.y
      value: 0
      objectReference: {fileID: 0}
    - target: {fileID: 471166, guid: f4f6b630159e6b34386dec2579f250b2, type: 3}
      propertyPath: m_LocalEulerAnglesHint.z
      value: 0
      objectReference: {fileID: 0}
    m_RemovedComponents: []
  m_SourcePrefab: {fileID: 100100000, guid: f4f6b630159e6b34386dec2579f250b2, type: 3}
--- !u!4 &1506561079 stripped
Transform:
  m_CorrespondingSourceObject: {fileID: 471166, guid: f4f6b630159e6b34386dec2579f250b2,
    type: 3}
  m_PrefabInstance: {fileID: 1509528196}
  m_PrefabAsset: {fileID: 0}
--- !u!1001 &1509528196
PrefabInstance:
  m_ObjectHideFlags: 0
  serializedVersion: 2
  m_Modification:
    m_TransformParent: {fileID: 1490319263}
    m_Modifications:
    - target: {fileID: 165880, guid: f4f6b630159e6b34386dec2579f250b2, type: 3}
      propertyPath: m_Name
      value: ETower 2 (1)
      objectReference: {fileID: 0}
    - target: {fileID: 471166, guid: f4f6b630159e6b34386dec2579f250b2, type: 3}
      propertyPath: m_LocalPosition.x
      value: 48.9
      objectReference: {fileID: 0}
    - target: {fileID: 471166, guid: f4f6b630159e6b34386dec2579f250b2, type: 3}
      propertyPath: m_LocalPosition.y
      value: -59.179356
      objectReference: {fileID: 0}
    - target: {fileID: 471166, guid: f4f6b630159e6b34386dec2579f250b2, type: 3}
      propertyPath: m_LocalPosition.z
      value: -3.3
      objectReference: {fileID: 0}
    - target: {fileID: 471166, guid: f4f6b630159e6b34386dec2579f250b2, type: 3}
      propertyPath: m_LocalRotation.x
      value: -0
      objectReference: {fileID: 0}
    - target: {fileID: 471166, guid: f4f6b630159e6b34386dec2579f250b2, type: 3}
      propertyPath: m_LocalRotation.y
      value: -0
      objectReference: {fileID: 0}
    - target: {fileID: 471166, guid: f4f6b630159e6b34386dec2579f250b2, type: 3}
      propertyPath: m_LocalRotation.z
      value: -0
      objectReference: {fileID: 0}
    - target: {fileID: 471166, guid: f4f6b630159e6b34386dec2579f250b2, type: 3}
      propertyPath: m_LocalRotation.w
      value: 1
      objectReference: {fileID: 0}
    - target: {fileID: 471166, guid: f4f6b630159e6b34386dec2579f250b2, type: 3}
      propertyPath: m_RootOrder
      value: 5
      objectReference: {fileID: 0}
    - target: {fileID: 471166, guid: f4f6b630159e6b34386dec2579f250b2, type: 3}
      propertyPath: m_LocalEulerAnglesHint.x
      value: 0
      objectReference: {fileID: 0}
    - target: {fileID: 471166, guid: f4f6b630159e6b34386dec2579f250b2, type: 3}
      propertyPath: m_LocalEulerAnglesHint.y
      value: 0
      objectReference: {fileID: 0}
    - target: {fileID: 471166, guid: f4f6b630159e6b34386dec2579f250b2, type: 3}
      propertyPath: m_LocalEulerAnglesHint.z
      value: 0
      objectReference: {fileID: 0}
    m_RemovedComponents: []
  m_SourcePrefab: {fileID: 100100000, guid: f4f6b630159e6b34386dec2579f250b2, type: 3}
--- !u!4 &1566173793 stripped
Transform:
  m_CorrespondingSourceObject: {fileID: 471166, guid: f4f6b630159e6b34386dec2579f250b2,
    type: 3}
  m_PrefabInstance: {fileID: 1583845113}
  m_PrefabAsset: {fileID: 0}
--- !u!1001 &1583845113
PrefabInstance:
  m_ObjectHideFlags: 0
  serializedVersion: 2
  m_Modification:
    m_TransformParent: {fileID: 1497094537}
    m_Modifications:
    - target: {fileID: 165880, guid: f4f6b630159e6b34386dec2579f250b2, type: 3}
      propertyPath: m_Name
      value: ETower 1 (1)
      objectReference: {fileID: 0}
    - target: {fileID: 471166, guid: f4f6b630159e6b34386dec2579f250b2, type: 3}
      propertyPath: m_LocalPosition.x
      value: 2.5999985
      objectReference: {fileID: 0}
    - target: {fileID: 471166, guid: f4f6b630159e6b34386dec2579f250b2, type: 3}
      propertyPath: m_LocalPosition.y
      value: -59.179356
      objectReference: {fileID: 0}
    - target: {fileID: 471166, guid: f4f6b630159e6b34386dec2579f250b2, type: 3}
      propertyPath: m_LocalPosition.z
      value: 94.7
      objectReference: {fileID: 0}
    - target: {fileID: 471166, guid: f4f6b630159e6b34386dec2579f250b2, type: 3}
      propertyPath: m_LocalRotation.x
      value: -0
      objectReference: {fileID: 0}
    - target: {fileID: 471166, guid: f4f6b630159e6b34386dec2579f250b2, type: 3}
      propertyPath: m_LocalRotation.y
      value: -0
      objectReference: {fileID: 0}
    - target: {fileID: 471166, guid: f4f6b630159e6b34386dec2579f250b2, type: 3}
      propertyPath: m_LocalRotation.z
      value: -0
      objectReference: {fileID: 0}
    - target: {fileID: 471166, guid: f4f6b630159e6b34386dec2579f250b2, type: 3}
      propertyPath: m_LocalRotation.w
      value: 1
      objectReference: {fileID: 0}
    - target: {fileID: 471166, guid: f4f6b630159e6b34386dec2579f250b2, type: 3}
      propertyPath: m_RootOrder
      value: 4
      objectReference: {fileID: 0}
    - target: {fileID: 471166, guid: f4f6b630159e6b34386dec2579f250b2, type: 3}
      propertyPath: m_LocalEulerAnglesHint.x
      value: 0
      objectReference: {fileID: 0}
    - target: {fileID: 471166, guid: f4f6b630159e6b34386dec2579f250b2, type: 3}
      propertyPath: m_LocalEulerAnglesHint.y
      value: 0
      objectReference: {fileID: 0}
    - target: {fileID: 471166, guid: f4f6b630159e6b34386dec2579f250b2, type: 3}
      propertyPath: m_LocalEulerAnglesHint.z
      value: 0
      objectReference: {fileID: 0}
    m_RemovedComponents: []
  m_SourcePrefab: {fileID: 100100000, guid: f4f6b630159e6b34386dec2579f250b2, type: 3}
--- !u!1001 &1591262586
PrefabInstance:
  m_ObjectHideFlags: 0
  serializedVersion: 2
  m_Modification:
    m_TransformParent: {fileID: 1497094537}
    m_Modifications:
    - target: {fileID: 165880, guid: f4f6b630159e6b34386dec2579f250b2, type: 3}
      propertyPath: m_Name
      value: ETower (2)
      objectReference: {fileID: 0}
    - target: {fileID: 471166, guid: f4f6b630159e6b34386dec2579f250b2, type: 3}
      propertyPath: m_LocalPosition.x
      value: -19.160828
      objectReference: {fileID: 0}
    - target: {fileID: 471166, guid: f4f6b630159e6b34386dec2579f250b2, type: 3}
      propertyPath: m_LocalPosition.y
      value: -59.179356
      objectReference: {fileID: 0}
    - target: {fileID: 471166, guid: f4f6b630159e6b34386dec2579f250b2, type: 3}
      propertyPath: m_LocalPosition.z
      value: -101.00001
      objectReference: {fileID: 0}
    - target: {fileID: 471166, guid: f4f6b630159e6b34386dec2579f250b2, type: 3}
      propertyPath: m_LocalRotation.x
      value: -0
      objectReference: {fileID: 0}
    - target: {fileID: 471166, guid: f4f6b630159e6b34386dec2579f250b2, type: 3}
      propertyPath: m_LocalRotation.y
      value: -0
      objectReference: {fileID: 0}
    - target: {fileID: 471166, guid: f4f6b630159e6b34386dec2579f250b2, type: 3}
      propertyPath: m_LocalRotation.z
      value: -0
      objectReference: {fileID: 0}
    - target: {fileID: 471166, guid: f4f6b630159e6b34386dec2579f250b2, type: 3}
      propertyPath: m_LocalRotation.w
      value: 1
      objectReference: {fileID: 0}
    - target: {fileID: 471166, guid: f4f6b630159e6b34386dec2579f250b2, type: 3}
      propertyPath: m_RootOrder
      value: 8
      objectReference: {fileID: 0}
    - target: {fileID: 471166, guid: f4f6b630159e6b34386dec2579f250b2, type: 3}
      propertyPath: m_LocalEulerAnglesHint.x
      value: 0
      objectReference: {fileID: 0}
    - target: {fileID: 471166, guid: f4f6b630159e6b34386dec2579f250b2, type: 3}
      propertyPath: m_LocalEulerAnglesHint.y
      value: 0
      objectReference: {fileID: 0}
    - target: {fileID: 471166, guid: f4f6b630159e6b34386dec2579f250b2, type: 3}
      propertyPath: m_LocalEulerAnglesHint.z
      value: 0
      objectReference: {fileID: 0}
    m_RemovedComponents: []
  m_SourcePrefab: {fileID: 100100000, guid: f4f6b630159e6b34386dec2579f250b2, type: 3}
--- !u!1001 &1653513577
PrefabInstance:
  m_ObjectHideFlags: 0
  serializedVersion: 2
  m_Modification:
    m_TransformParent: {fileID: 1490319263}
    m_Modifications:
    - target: {fileID: 165880, guid: f4f6b630159e6b34386dec2579f250b2, type: 3}
      propertyPath: m_Name
      value: ETower 3
      objectReference: {fileID: 0}
    - target: {fileID: 471166, guid: f4f6b630159e6b34386dec2579f250b2, type: 3}
      propertyPath: m_LocalPosition.x
      value: 15.2
      objectReference: {fileID: 0}
    - target: {fileID: 471166, guid: f4f6b630159e6b34386dec2579f250b2, type: 3}
      propertyPath: m_LocalPosition.y
      value: -59.179356
      objectReference: {fileID: 0}
    - target: {fileID: 471166, guid: f4f6b630159e6b34386dec2579f250b2, type: 3}
      propertyPath: m_LocalPosition.z
      value: -18.1
      objectReference: {fileID: 0}
    - target: {fileID: 471166, guid: f4f6b630159e6b34386dec2579f250b2, type: 3}
      propertyPath: m_LocalRotation.x
      value: -0
      objectReference: {fileID: 0}
    - target: {fileID: 471166, guid: f4f6b630159e6b34386dec2579f250b2, type: 3}
      propertyPath: m_LocalRotation.y
      value: -0
      objectReference: {fileID: 0}
    - target: {fileID: 471166, guid: f4f6b630159e6b34386dec2579f250b2, type: 3}
      propertyPath: m_LocalRotation.z
      value: -0
      objectReference: {fileID: 0}
    - target: {fileID: 471166, guid: f4f6b630159e6b34386dec2579f250b2, type: 3}
      propertyPath: m_LocalRotation.w
      value: 1
      objectReference: {fileID: 0}
    - target: {fileID: 471166, guid: f4f6b630159e6b34386dec2579f250b2, type: 3}
      propertyPath: m_RootOrder
      value: 2
      objectReference: {fileID: 0}
    - target: {fileID: 471166, guid: f4f6b630159e6b34386dec2579f250b2, type: 3}
      propertyPath: m_LocalEulerAnglesHint.x
      value: 0
      objectReference: {fileID: 0}
    - target: {fileID: 471166, guid: f4f6b630159e6b34386dec2579f250b2, type: 3}
      propertyPath: m_LocalEulerAnglesHint.y
      value: 0
      objectReference: {fileID: 0}
    - target: {fileID: 471166, guid: f4f6b630159e6b34386dec2579f250b2, type: 3}
      propertyPath: m_LocalEulerAnglesHint.z
      value: 0
      objectReference: {fileID: 0}
    m_RemovedComponents: []
  m_SourcePrefab: {fileID: 100100000, guid: f4f6b630159e6b34386dec2579f250b2, type: 3}
--- !u!4 &1681970694 stripped
Transform:
  m_CorrespondingSourceObject: {fileID: 471166, guid: f4f6b630159e6b34386dec2579f250b2,
    type: 3}
  m_PrefabInstance: {fileID: 82197251}
  m_PrefabAsset: {fileID: 0}
--- !u!1001 &1852166273
PrefabInstance:
  m_ObjectHideFlags: 0
  serializedVersion: 2
  m_Modification:
    m_TransformParent: {fileID: 1490319263}
    m_Modifications:
    - target: {fileID: 165880, guid: f4f6b630159e6b34386dec2579f250b2, type: 3}
      propertyPath: m_Name
      value: ETower 1 (1)
      objectReference: {fileID: 0}
    - target: {fileID: 471166, guid: f4f6b630159e6b34386dec2579f250b2, type: 3}
      propertyPath: m_LocalPosition.x
      value: 2.5999985
      objectReference: {fileID: 0}
    - target: {fileID: 471166, guid: f4f6b630159e6b34386dec2579f250b2, type: 3}
      propertyPath: m_LocalPosition.y
      value: -59.179356
      objectReference: {fileID: 0}
    - target: {fileID: 471166, guid: f4f6b630159e6b34386dec2579f250b2, type: 3}
      propertyPath: m_LocalPosition.z
      value: 81.6
      objectReference: {fileID: 0}
    - target: {fileID: 471166, guid: f4f6b630159e6b34386dec2579f250b2, type: 3}
      propertyPath: m_LocalRotation.x
      value: -0
      objectReference: {fileID: 0}
    - target: {fileID: 471166, guid: f4f6b630159e6b34386dec2579f250b2, type: 3}
      propertyPath: m_LocalRotation.y
      value: -0
      objectReference: {fileID: 0}
    - target: {fileID: 471166, guid: f4f6b630159e6b34386dec2579f250b2, type: 3}
      propertyPath: m_LocalRotation.z
      value: -0
      objectReference: {fileID: 0}
    - target: {fileID: 471166, guid: f4f6b630159e6b34386dec2579f250b2, type: 3}
      propertyPath: m_LocalRotation.w
      value: 1
      objectReference: {fileID: 0}
    - target: {fileID: 471166, guid: f4f6b630159e6b34386dec2579f250b2, type: 3}
      propertyPath: m_RootOrder
      value: 4
      objectReference: {fileID: 0}
    - target: {fileID: 471166, guid: f4f6b630159e6b34386dec2579f250b2, type: 3}
      propertyPath: m_LocalEulerAnglesHint.x
      value: 0
      objectReference: {fileID: 0}
    - target: {fileID: 471166, guid: f4f6b630159e6b34386dec2579f250b2, type: 3}
      propertyPath: m_LocalEulerAnglesHint.y
      value: 0
      objectReference: {fileID: 0}
    - target: {fileID: 471166, guid: f4f6b630159e6b34386dec2579f250b2, type: 3}
      propertyPath: m_LocalEulerAnglesHint.z
      value: 0
      objectReference: {fileID: 0}
    m_RemovedComponents: []
  m_SourcePrefab: {fileID: 100100000, guid: f4f6b630159e6b34386dec2579f250b2, type: 3}
--- !u!4 &1856375211 stripped
Transform:
  m_CorrespondingSourceObject: {fileID: 471166, guid: f4f6b630159e6b34386dec2579f250b2,
    type: 3}
  m_PrefabInstance: {fileID: 371156415}
  m_PrefabAsset: {fileID: 0}
--- !u!1001 &1924900281
PrefabInstance:
  m_ObjectHideFlags: 0
  serializedVersion: 2
  m_Modification:
    m_TransformParent: {fileID: 1490319263}
    m_Modifications:
    - target: {fileID: 165880, guid: f4f6b630159e6b34386dec2579f250b2, type: 3}
      propertyPath: m_Name
      value: ETower (1)
      objectReference: {fileID: 0}
    - target: {fileID: 471166, guid: f4f6b630159e6b34386dec2579f250b2, type: 3}
      propertyPath: m_LocalPosition.x
      value: -19.160828
      objectReference: {fileID: 0}
    - target: {fileID: 471166, guid: f4f6b630159e6b34386dec2579f250b2, type: 3}
      propertyPath: m_LocalPosition.y
      value: -59.179356
      objectReference: {fileID: 0}
    - target: {fileID: 471166, guid: f4f6b630159e6b34386dec2579f250b2, type: 3}
      propertyPath: m_LocalPosition.z
      value: 81.6
      objectReference: {fileID: 0}
    - target: {fileID: 471166, guid: f4f6b630159e6b34386dec2579f250b2, type: 3}
      propertyPath: m_LocalRotation.x
      value: -0
      objectReference: {fileID: 0}
    - target: {fileID: 471166, guid: f4f6b630159e6b34386dec2579f250b2, type: 3}
      propertyPath: m_LocalRotation.y
      value: -0
      objectReference: {fileID: 0}
    - target: {fileID: 471166, guid: f4f6b630159e6b34386dec2579f250b2, type: 3}
      propertyPath: m_LocalRotation.z
      value: -0
      objectReference: {fileID: 0}
    - target: {fileID: 471166, guid: f4f6b630159e6b34386dec2579f250b2, type: 3}
      propertyPath: m_LocalRotation.w
      value: 1
      objectReference: {fileID: 0}
    - target: {fileID: 471166, guid: f4f6b630159e6b34386dec2579f250b2, type: 3}
      propertyPath: m_RootOrder
      value: 3
      objectReference: {fileID: 0}
    - target: {fileID: 471166, guid: f4f6b630159e6b34386dec2579f250b2, type: 3}
      propertyPath: m_LocalEulerAnglesHint.x
      value: 0
      objectReference: {fileID: 0}
    - target: {fileID: 471166, guid: f4f6b630159e6b34386dec2579f250b2, type: 3}
      propertyPath: m_LocalEulerAnglesHint.y
      value: 0
      objectReference: {fileID: 0}
    - target: {fileID: 471166, guid: f4f6b630159e6b34386dec2579f250b2, type: 3}
      propertyPath: m_LocalEulerAnglesHint.z
      value: 0
      objectReference: {fileID: 0}
    m_RemovedComponents: []
  m_SourcePrefab: {fileID: 100100000, guid: f4f6b630159e6b34386dec2579f250b2, type: 3}
--- !u!4 &1946396783 stripped
Transform:
  m_CorrespondingSourceObject: {fileID: 471166, guid: f4f6b630159e6b34386dec2579f250b2,
    type: 3}
  m_PrefabInstance: {fileID: 2143226226}
  m_PrefabAsset: {fileID: 0}
--- !u!1001 &1949650724
PrefabInstance:
  m_ObjectHideFlags: 0
  serializedVersion: 2
  m_Modification:
    m_TransformParent: {fileID: 1490319263}
    m_Modifications:
    - target: {fileID: 165880, guid: f4f6b630159e6b34386dec2579f250b2, type: 3}
      propertyPath: m_Name
      value: ETower 2 (2)
      objectReference: {fileID: 0}
    - target: {fileID: 471166, guid: f4f6b630159e6b34386dec2579f250b2, type: 3}
      propertyPath: m_LocalPosition.x
      value: 48.9
      objectReference: {fileID: 0}
    - target: {fileID: 471166, guid: f4f6b630159e6b34386dec2579f250b2, type: 3}
      propertyPath: m_LocalPosition.y
      value: -59.179356
      objectReference: {fileID: 0}
    - target: {fileID: 471166, guid: f4f6b630159e6b34386dec2579f250b2, type: 3}
      propertyPath: m_LocalPosition.z
      value: -30.1
      objectReference: {fileID: 0}
    - target: {fileID: 471166, guid: f4f6b630159e6b34386dec2579f250b2, type: 3}
      propertyPath: m_LocalRotation.x
      value: -0
      objectReference: {fileID: 0}
    - target: {fileID: 471166, guid: f4f6b630159e6b34386dec2579f250b2, type: 3}
      propertyPath: m_LocalRotation.y
      value: -0
      objectReference: {fileID: 0}
    - target: {fileID: 471166, guid: f4f6b630159e6b34386dec2579f250b2, type: 3}
      propertyPath: m_LocalRotation.z
      value: -0
      objectReference: {fileID: 0}
    - target: {fileID: 471166, guid: f4f6b630159e6b34386dec2579f250b2, type: 3}
      propertyPath: m_LocalRotation.w
      value: 1
      objectReference: {fileID: 0}
    - target: {fileID: 471166, guid: f4f6b630159e6b34386dec2579f250b2, type: 3}
      propertyPath: m_RootOrder
      value: 9
      objectReference: {fileID: 0}
    - target: {fileID: 471166, guid: f4f6b630159e6b34386dec2579f250b2, type: 3}
      propertyPath: m_LocalEulerAnglesHint.x
      value: 0
      objectReference: {fileID: 0}
    - target: {fileID: 471166, guid: f4f6b630159e6b34386dec2579f250b2, type: 3}
      propertyPath: m_LocalEulerAnglesHint.y
      value: 0
      objectReference: {fileID: 0}
    - target: {fileID: 471166, guid: f4f6b630159e6b34386dec2579f250b2, type: 3}
      propertyPath: m_LocalEulerAnglesHint.z
      value: 0
      objectReference: {fileID: 0}
    m_RemovedComponents: []
  m_SourcePrefab: {fileID: 100100000, guid: f4f6b630159e6b34386dec2579f250b2, type: 3}
--- !u!4 &1967898068 stripped
Transform:
  m_CorrespondingSourceObject: {fileID: 471166, guid: f4f6b630159e6b34386dec2579f250b2,
    type: 3}
  m_PrefabInstance: {fileID: 994432591}
  m_PrefabAsset: {fileID: 0}
--- !u!1001 &2025539626
PrefabInstance:
  m_ObjectHideFlags: 0
  serializedVersion: 2
  m_Modification:
    m_TransformParent: {fileID: 1490319263}
    m_Modifications:
    - target: {fileID: 165880, guid: f4f6b630159e6b34386dec2579f250b2, type: 3}
      propertyPath: m_Name
      value: ETower
      objectReference: {fileID: 0}
    - target: {fileID: 471166, guid: f4f6b630159e6b34386dec2579f250b2, type: 3}
      propertyPath: m_LocalPosition.x
      value: -35
      objectReference: {fileID: 0}
    - target: {fileID: 471166, guid: f4f6b630159e6b34386dec2579f250b2, type: 3}
      propertyPath: m_LocalPosition.y
      value: -59.179356
      objectReference: {fileID: 0}
    - target: {fileID: 471166, guid: f4f6b630159e6b34386dec2579f250b2, type: 3}
      propertyPath: m_LocalPosition.z
      value: -18.1
      objectReference: {fileID: 0}
    - target: {fileID: 471166, guid: f4f6b630159e6b34386dec2579f250b2, type: 3}
      propertyPath: m_LocalRotation.x
      value: -0
      objectReference: {fileID: 0}
    - target: {fileID: 471166, guid: f4f6b630159e6b34386dec2579f250b2, type: 3}
      propertyPath: m_LocalRotation.y
      value: -0
      objectReference: {fileID: 0}
    - target: {fileID: 471166, guid: f4f6b630159e6b34386dec2579f250b2, type: 3}
      propertyPath: m_LocalRotation.z
      value: -0
      objectReference: {fileID: 0}
    - target: {fileID: 471166, guid: f4f6b630159e6b34386dec2579f250b2, type: 3}
      propertyPath: m_LocalRotation.w
      value: 1
      objectReference: {fileID: 0}
    - target: {fileID: 471166, guid: f4f6b630159e6b34386dec2579f250b2, type: 3}
      propertyPath: m_RootOrder
      value: 0
      objectReference: {fileID: 0}
    - target: {fileID: 471166, guid: f4f6b630159e6b34386dec2579f250b2, type: 3}
      propertyPath: m_LocalEulerAnglesHint.x
      value: 0
      objectReference: {fileID: 0}
    - target: {fileID: 471166, guid: f4f6b630159e6b34386dec2579f250b2, type: 3}
      propertyPath: m_LocalEulerAnglesHint.y
      value: 0
      objectReference: {fileID: 0}
    - target: {fileID: 471166, guid: f4f6b630159e6b34386dec2579f250b2, type: 3}
      propertyPath: m_LocalEulerAnglesHint.z
      value: 0
      objectReference: {fileID: 0}
    m_RemovedComponents: []
  m_SourcePrefab: {fileID: 100100000, guid: f4f6b630159e6b34386dec2579f250b2, type: 3}
--- !u!4 &2069975943 stripped
Transform:
  m_CorrespondingSourceObject: {fileID: 471166, guid: f4f6b630159e6b34386dec2579f250b2,
    type: 3}
  m_PrefabInstance: {fileID: 1148221754}
  m_PrefabAsset: {fileID: 0}
--- !u!4 &2079019602 stripped
Transform:
  m_CorrespondingSourceObject: {fileID: 471166, guid: f4f6b630159e6b34386dec2579f250b2,
    type: 3}
  m_PrefabInstance: {fileID: 835158233}
  m_PrefabAsset: {fileID: 0}
--- !u!1001 &2143226226
PrefabInstance:
  m_ObjectHideFlags: 0
  serializedVersion: 2
  m_Modification:
    m_TransformParent: {fileID: 1490319263}
    m_Modifications:
    - target: {fileID: 165880, guid: f4f6b630159e6b34386dec2579f250b2, type: 3}
      propertyPath: m_Name
      value: ETower (2)
      objectReference: {fileID: 0}
    - target: {fileID: 471166, guid: f4f6b630159e6b34386dec2579f250b2, type: 3}
      propertyPath: m_LocalPosition.x
      value: -19.160828
      objectReference: {fileID: 0}
    - target: {fileID: 471166, guid: f4f6b630159e6b34386dec2579f250b2, type: 3}
      propertyPath: m_LocalPosition.y
      value: -59.179356
      objectReference: {fileID: 0}
    - target: {fileID: 471166, guid: f4f6b630159e6b34386dec2579f250b2, type: 3}
      propertyPath: m_LocalPosition.z
      value: -114.1
      objectReference: {fileID: 0}
    - target: {fileID: 471166, guid: f4f6b630159e6b34386dec2579f250b2, type: 3}
      propertyPath: m_LocalRotation.x
      value: -0
      objectReference: {fileID: 0}
    - target: {fileID: 471166, guid: f4f6b630159e6b34386dec2579f250b2, type: 3}
      propertyPath: m_LocalRotation.y
      value: -0
      objectReference: {fileID: 0}
    - target: {fileID: 471166, guid: f4f6b630159e6b34386dec2579f250b2, type: 3}
      propertyPath: m_LocalRotation.z
      value: -0
      objectReference: {fileID: 0}
    - target: {fileID: 471166, guid: f4f6b630159e6b34386dec2579f250b2, type: 3}
      propertyPath: m_LocalRotation.w
      value: 1
      objectReference: {fileID: 0}
    - target: {fileID: 471166, guid: f4f6b630159e6b34386dec2579f250b2, type: 3}
      propertyPath: m_RootOrder
      value: 7
      objectReference: {fileID: 0}
    - target: {fileID: 471166, guid: f4f6b630159e6b34386dec2579f250b2, type: 3}
      propertyPath: m_LocalEulerAnglesHint.x
      value: 0
      objectReference: {fileID: 0}
    - target: {fileID: 471166, guid: f4f6b630159e6b34386dec2579f250b2, type: 3}
      propertyPath: m_LocalEulerAnglesHint.y
      value: 0
      objectReference: {fileID: 0}
    - target: {fileID: 471166, guid: f4f6b630159e6b34386dec2579f250b2, type: 3}
      propertyPath: m_LocalEulerAnglesHint.z
      value: 0
      objectReference: {fileID: 0}
    m_RemovedComponents: []
  m_SourcePrefab: {fileID: 100100000, guid: f4f6b630159e6b34386dec2579f250b2, type: 3}
