{
    "variables": {
    "name": "jose-viegas-20-08-2020",
    "secret": "{{env `GCP_KEY`}}"
    },

"builders": [
    {
      "type": "googlecompute",
      "account_file": "{{user `secret`}}",
      "project_id": "teste-284212",
      "source_image": "ubuntu-2004-focal-v20200720",
      "ssh_username": "ubuntu",
      "zone": "us-central1-a",
      "image_name": "{{user `name`}}",
      "image_description": "from ubuntu-2004-lts family"
      }
   ],
   "provisioners": [
       {
           "type": "ansible",
           "playbook_file": "./playbook.yml",
           "galaxy_file": "./requirements.yml",
           "user": "ubuntu",
           "extra_arguments": ["-b"]
       }
   ]
}