@startuml
class Experiencia {
+anys : int
}
class Encarregat {
+treballadorsACarrec : Treballador [5..*]
}
abstract class Feina {

}

Treballador "0..*" o- "3..*" Habilitat : habilitats
(Treballador, Habilitat) .. Experiencia
Treballador "1" --> "0..1" Encarregat : "rolEncarregat"
Habilitat <-- Activitat
Activitat --* Projecte
Activitat "0..*" <-- "0..1" Activitat: activitatsPosterior
Activitat --|> Feina
Projecte -|> Feina

@enduml
