@startuml
Animal <|-- Gos
Gos <|-- PastorAlemany
@enduml

@startuml
Especie <|-- Gos
Gos <|-- PastorAlemany
note right of PastorAlemany
Els pastors alemanys
no són una espècie!
end note
@enduml

@startuml
Gos <|-- PastorAlemany
Gos .> Especie : instancia
@enduml
