__      __ ___     ___     ___     _       ___   
\ \    / // _ \   | _ \   |   \   | |     | __|  
 \ \/\/ /| (_) |  |   /   | |) |  | |__   | _|   
  \_/\_/  \___/   |_|_\   |___/   |____|  |___|  
_|"""""|_|"""""|_|"""""|_|"""""|_|"""""|_|"""""| 
"`-0-0-'"`-0-0-'"`-0-0-'"`-0-0-'"`-0-0-'"`-0-0-' 
;------------------------------------------------