%YAML 1.1
%TAG !u! tag:unity3d.com,2011:
--- !u!29 &1
OcclusionCullingSettings:
  m_ObjectHideFlags: 0
  serializedVersion: 2
  m_OcclusionBakeSettings:
    smallestOccluder: 5
    smallestHole: 0.25
    backfaceThreshold: 100
  m_SceneGUID: 00000000000000000000000000000000
  m_OcclusionCullingData: {fileID: 0}
--- !u!104 &2
RenderSettings:
  m_ObjectHideFlags: 0
  serializedVersion: 9
  m_Fog: 0
  m_FogColor: {r: 0.5, g: 0.5, b: 0.5, a: 1}
  m_FogMode: 3
  m_FogDensity: 0.01
  m_LinearFogStart: 0
  m_LinearFogEnd: 300
  m_AmbientSkyColor: {r: 0.212, g: 0.227, b: 0.259, a: 1}
  m_AmbientEquatorColor: {r: 0.114, g: 0.125, b: 0.133, a: 1}
  m_AmbientGroundColor: {r: 0.047, g: 0.043, b: 0.035, a: 1}
  m_AmbientIntensity: 1
  m_AmbientMode: 3
  m_SubtractiveShadowColor: {r: 0.42, g: 0.478, b: 0.627, a: 1}
  m_SkyboxMaterial: {fileID: 0}
  m_HaloStrength: 0.5
  m_FlareStrength: 1
  m_FlareFadeSpeed: 3
  m_HaloTexture: {fileID: 0}
  m_SpotCookie: {fileID: 10001, guid: 0000000000000000e000000000000000, type: 0}
  m_DefaultReflectionMode: 0
  m_DefaultReflectionResolution: 128
  m_ReflectionBounces: 1
  m_ReflectionIntensity: 1
  m_CustomReflection: {fileID: 0}
  m_Sun: {fileID: 0}
  m_IndirectSpecularColor: {r: 0, g: 0, b: 0, a: 1}
  m_UseRadianceAmbientProbe: 0
--- !u!157 &3
LightmapSettings:
  m_ObjectHideFlags: 0
  serializedVersion: 12
  m_GIWorkflowMode: 1
  m_GISettings:
    serializedVersion: 2
    m_BounceScale: 1
    m_IndirectOutputScale: 1
    m_AlbedoBoost: 1
    m_EnvironmentLightingMode: 0
    m_EnableBakedLightmaps: 0
    m_EnableRealtimeLightmaps: 0
  m_LightmapEditorSettings:
    serializedVersion: 12
    m_Resolution: 2
    m_BakeResolution: 40
    m_AtlasSize: 1024
    m_AO: 0
    m_AOMaxDistance: 1
    m_CompAOExponent: 1
    m_CompAOExponentDirect: 0
    m_ExtractAmbientOcclusion: 0
    m_Padding: 2
    m_LightmapParameters: {fileID: 0}
    m_LightmapsBakeMode: 1
    m_TextureCompression: 1
    m_FinalGather: 0
    m_FinalGatherFiltering: 1
    m_FinalGatherRayCount: 256
    m_ReflectionCompression: 2
    m_MixedBakeMode: 2
    m_BakeBackend: 0
    m_PVRSampling: 1
    m_PVRDirectSampleCount: 32
    m_PVRSampleCount: 500
    m_PVRBounces: 2
    m_PVREnvironmentSampleCount: 500
    m_PVREnvironmentReferencePointCount: 2048
    m_PVRFilteringMode: 2
    m_PVRDenoiserTypeDirect: 0
    m_PVRDenoiserTypeIndirect: 0
    m_PVRDenoiserTypeAO: 0
    m_PVRFilterTypeDirect: 0
    m_PVRFilterTypeIndirect: 0
    m_PVRFilterTypeAO: 0
    m_PVREnvironmentMIS: 0
    m_PVRCulling: 1
    m_PVRFilteringGaussRadiusDirect: 1
    m_PVRFilteringGaussRadiusIndirect: 5
    m_PVRFilteringGaussRadiusAO: 2
    m_PVRFilteringAtrousPositionSigmaDirect: 0.5
    m_PVRFilteringAtrousPositionSigmaIndirect: 2
    m_PVRFilteringAtrousPositionSigmaAO: 1
    m_ExportTrainingData: 0
    m_TrainingDataDestination: TrainingData
    m_LightProbeSampleCountMultiplier: 4
  m_LightingDataAsset: {fileID: 0}
  m_LightingSettings: {fileID: 0}
--- !u!196 &4
NavMeshSettings:
  serializedVersion: 2
  m_ObjectHideFlags: 0
  m_BuildSettings:
    serializedVersion: 3
    agentTypeID: 0
    agentRadius: 0.5
    agentHeight: 2
    agentSlope: 45
    agentClimb: 0.4
    ledgeDropHeight: 0
    maxJumpAcrossDistance: 0
    minRegionArea: 2
    manualCellSize: 0
    cellSize: 0.16666667
    manualTileSize: 0
    tileSize: 256
    buildHeightMesh: 0
    maxJobWorkers: 0
    preserveTilesOutsideBounds: 0
    debug:
      m_Flags: 0
  m_NavMeshData: {fileID: 0}
--- !u!1001 &781759809
PrefabInstance:
  m_ObjectHideFlags: 0
  serializedVersion: 2
  m_Modification:
    serializedVersion: 3
    m_TransformParent: {fileID: 0}
    m_Modifications:
    - target: {fileID: 1385853540176189092, guid: 0decdf0f9958ecb45bf4fb4dbb7aa1c1, type: 3}
      propertyPath: m_LinearDrag
      value: 1
      objectReference: {fileID: 0}
    - target: {fileID: 1385853540176189092, guid: 0decdf0f9958ecb45bf4fb4dbb7aa1c1, type: 3}
      propertyPath: m_AngularDrag
      value: 0
      objectReference: {fileID: 0}
    - target: {fileID: 4026792722770486834, guid: 0decdf0f9958ecb45bf4fb4dbb7aa1c1, type: 3}
      propertyPath: m_LinearDrag
      value: 1
      objectReference: {fileID: 0}
    - target: {fileID: 4026792724378935101, guid: 0decdf0f9958ecb45bf4fb4dbb7aa1c1, type: 3}
      propertyPath: m_LinearDrag
      value: 1
      objectReference: {fileID: 0}
    - target: {fileID: 4026792724568846035, guid: 0decdf0f9958ecb45bf4fb4dbb7aa1c1, type: 3}
      propertyPath: m_LinearDrag
      value: 1
      objectReference: {fileID: 0}
    - target: {fileID: 4026792724879307912, guid: 0decdf0f9958ecb45bf4fb4dbb7aa1c1, type: 3}
      propertyPath: m_LinearDrag
      value: 1
      objectReference: {fileID: 0}
    - target: {fileID: 4210249964250231302, guid: 0decdf0f9958ecb45bf4fb4dbb7aa1c1, type: 3}
      propertyPath: m_LocalPosition.x
      value: 0
      objectReference: {fileID: 0}
    - target: {fileID: 4210249964250231302, guid: 0decdf0f9958ecb45bf4fb4dbb7aa1c1, type: 3}
      propertyPath: m_LocalPosition.y
      value: 0
      objectReference: {fileID: 0}
    - target: {fileID: 4210249964250231302, guid: 0decdf0f9958ecb45bf4fb4dbb7aa1c1, type: 3}
      propertyPath: m_LocalPosition.z
      value: 0
      objectReference: {fileID: 0}
    - target: {fileID: 4210249964250231302, guid: 0decdf0f9958ecb45bf4fb4dbb7aa1c1, type: 3}
      propertyPath: m_LocalRotation.w
      value: 1
      objectReference: {fileID: 0}
    - target: {fileID: 4210249964250231302, guid: 0decdf0f9958ecb45bf4fb4dbb7aa1c1, type: 3}
      propertyPath: m_LocalRotation.x
      value: 0
      objectReference: {fileID: 0}
    - target: {fileID: 4210249964250231302, guid: 0decdf0f9958ecb45bf4fb4dbb7aa1c1, type: 3}
      propertyPath: m_LocalRotation.y
      value: 0
      objectReference: {fileID: 0}
    - target: {fileID: 4210249964250231302, guid: 0decdf0f9958ecb45bf4fb4dbb7aa1c1, type: 3}
      propertyPath: m_LocalRotation.z
      value: 0
      objectReference: {fileID: 0}
    - target: {fileID: 4210249964250231302, guid: 0decdf0f9958ecb45bf4fb4dbb7aa1c1, type: 3}
      propertyPath: m_LocalEulerAnglesHint.x
      value: 0
      objectReference: {fileID: 0}
    - target: {fileID: 4210249964250231302, guid: 0decdf0f9958ecb45bf4fb4dbb7aa1c1, type: 3}
      propertyPath: m_LocalEulerAnglesHint.y
      value: 0
      objectReference: {fileID: 0}
    - target: {fileID: 4210249964250231302, guid: 0decdf0f9958ecb45bf4fb4dbb7aa1c1, type: 3}
      propertyPath: m_LocalEulerAnglesHint.z
      value: 0
      objectReference: {fileID: 0}
    - target: {fileID: 8252158394247754799, guid: 0decdf0f9958ecb45bf4fb4dbb7aa1c1, type: 3}
      propertyPath: m_Name
      value: Scene
      objectReference: {fileID: 0}
    - target: {fileID: 8749248065419207047, guid: 0decdf0f9958ecb45bf4fb4dbb7aa1c1, type: 3}
      propertyPath: m_LinearDrag
      value: 1
      objectReference: {fileID: 0}
    - target: {fileID: 8749248066221857637, guid: 0decdf0f9958ecb45bf4fb4dbb7aa1c1, type: 3}
      propertyPath: m_LinearDrag
      value: 1
      objectReference: {fileID: 0}
    - target: {fileID: 8749248066971313500, guid: 0decdf0f9958ecb45bf4fb4dbb7aa1c1, type: 3}
      propertyPath: m_LinearDrag
      value: 1
      objectReference: {fileID: 0}
    - target: {fileID: 8898805941532290064, guid: 0decdf0f9958ecb45bf4fb4dbb7aa1c1, type: 3}
      propertyPath: m_LocalPosition.x
      value: -0.09
      objectReference: {fileID: 0}
    - target: {fileID: 8898805941532290079, guid: 0decdf0f9958ecb45bf4fb4dbb7aa1c1, type: 3}
      propertyPath: orthographic size
      value: 1.6288813
      objectReference: {fileID: 0}
    - target: {fileID: 8898805941635572812, guid: 0decdf0f9958ecb45bf4fb4dbb7aa1c1, type: 3}
      propertyPath: m_LocalScale.x
      value: 0.81
      objectReference: {fileID: 0}
    - target: {fileID: 8898805941635572812, guid: 0decdf0f9958ecb45bf4fb4dbb7aa1c1, type: 3}
      propertyPath: m_LocalScale.y
      value: 3.5
      objectReference: {fileID: 0}
    - target: {fileID: 8898805941635572812, guid: 0decdf0f9958ecb45bf4fb4dbb7aa1c1, type: 3}
      propertyPath: m_LocalPosition.x
      value: -0.4953
      objectReference: {fileID: 0}
    - target: {fileID: 8898805941635572813, guid: 0decdf0f9958ecb45bf4fb4dbb7aa1c1, type: 3}
      propertyPath: m_Sprite
      value: 
      objectReference: {fileID: 21300000, guid: 23bb0519b903f314f9dc300e093a5dc9, type: 3}
    - target: {fileID: 8898805941635572813, guid: 0decdf0f9958ecb45bf4fb4dbb7aa1c1, type: 3}
      propertyPath: m_Color.b
      value: 1
      objectReference: {fileID: 0}
    - target: {fileID: 8898805941635572813, guid: 0decdf0f9958ecb45bf4fb4dbb7aa1c1, type: 3}
      propertyPath: m_Color.g
      value: 1
      objectReference: {fileID: 0}
    - target: {fileID: 8898805941635572813, guid: 0decdf0f9958ecb45bf4fb4dbb7aa1c1, type: 3}
      propertyPath: m_WasSpriteAssigned
      value: 1
      objectReference: {fileID: 0}
    m_RemovedComponents: []
    m_RemovedGameObjects: []
    m_AddedGameObjects: []
    m_AddedComponents: []
  m_SourcePrefab: {fileID: 100100000, guid: 0decdf0f9958ecb45bf4fb4dbb7aa1c1, type: 3}
--- !u!1660057539 &9223372036854775807
SceneRoots:
  m_ObjectHideFlags: 0
  m_Roots:
  - {fileID: 781759809}
