{
  "id":"5",
  "enunciat": "Descripció\nFes un programa que rebi dos nombres enters i imprimeixi true si el primer és major que el segon, false en cap altre cas.\nEntrada\nPer l’entrada rebreu dos nombres enters.\nSortida\nPer la sortida sempre haureu d’imprimir un boolean a true si el primer enter és major que el segon i un boolean a false en\nqualsevol altre cas.",
  "entradaPublica": "34 23",
  "sortidaPublica": "true",
  "entradaPrivada": "1233 1233",
  "sortidaPrivada": "false"
}