{
  "id":"3",
  "enunciat": "Descripció\nLlegeix un valor amb decimals i imprimeix el doble.\nEntrada\nPer l’entrada rebreu el nombre decimal.\nSortida\nPer la sortida sempre haureu d’imprimir un altre decimal amb el doble del valor del qual heu rebut per entrada.",
  "entradaPublica": "2.1",
  "sortidaPublica": "4.2",
  "entradaPrivada": "123.456",
  "sortidaPrivada": "246.912"
}