<svg width="5" height="8" viewBox="0 0 5 8" fill="none" xmlns="http://www.w3.org/2000/svg">
<path d="M4.56607 7.60168C3.93205 7.68935 3.28329 7.73319 2.64927 7.71857C1.42547 7.71857 0.349121 7.41172 0.349121 5.70213V2.5898C0.349121 0.880212 1.44022 0.587974 2.66402 0.587974C3.29804 0.573362 3.93205 0.617198 4.56607 0.704869C4.69877 0.719481 4.75775 0.777929 4.75775 0.894824V1.77154C4.75775 1.87382 4.66928 1.96149 4.56607 1.96149H2.57555C2.13321 1.96149 1.97103 2.10761 1.97103 2.60441V3.4519H4.49235C4.59556 3.4519 4.68403 3.53957 4.68403 3.64186V4.53318C4.68403 4.63547 4.59556 4.72314 4.49235 4.72314H1.97103V5.71675C1.97103 6.19894 2.13321 6.35967 2.57555 6.35967H4.56607C4.66928 6.35967 4.75775 6.44734 4.75775 6.54962V7.42634C4.75775 7.52862 4.69877 7.58707 4.56607 7.60168Z" fill="white"/>
</svg>
