Inicio 29 abril

billing and payments
-single payments
  ej:pagar tarjetade credito

-auto payment
  recurrente(mensual, automatico)
  ej:pague solo

-list credit
  cargos pendientes
  ultimos cargos
  payment-transactions
  ej:revisar

-mantenance
  cargos pendientes
  ultimos cargos
  Recent-Transactions


|--------------------------------------------------------------------------------------------------------------|
|                                               everis españa (laboratorios)                                   |
|------------------------------------------------------------------------------------------------------------- |
|   mobile       | IBM           | MULE      |   Middlewere core ( database )    |  IBM (core)                 |
|    5.0         | API-CONNECT   |           |          BankesFire (BKS)         |    Base de dator            |
|                |               |           |                                   |    PARTENON-MAINFRAME       |
|                |  SUAGGER      |           |      Contendrá/expone todos los   |                             |
|                |  YAML         |           |           servicios               |                             |
|                |               |           |      Es un WAR->WAS               |                             |
|                |               |           |                                   |                             |
|                |               |           |      Conecta con el core          |                             |
|                |               |           |                                   |                             |
|                |               |           |          TRX                      |                             |
|--------------------------------------------------------------------------------------------------------------|

-------------------------------
            APPIMATIC         |
------------------------------
  RAML   transforma  YAML     |
------------------------------


  Transfer !=  payment


leeer en drive
inseption Workshop closure credit card
20190422_nit_v2.0



PAN -> Numero largo de la tarjeta
