---
Sprin planin:
  -dividir las tareas que durarán cada split
  -un dia de essfuerso o menos
  -tener un track fluido
  -tomar los riesgos lo mas rapido posible, prevenir empedimento.
  -Qué vamos a entreagr? para este splin somo capaces de entrgar****
  -

---
Planing poker:
  Qué tan complejo es realizarlo

Risk room:
  -estados a cada una de las cosas.
  -las cosas que causan empedomento
  -estados (checar foto)
    *owned
    *Resolved
    *Mitigater
    *accepted

---
Empezar con list of credit card payments:
  -Diagramas de secuencia (Diagrams drafts) borrador asumiendo los supestos.
    *Single pyment
    *Autopaument
    *List of credit card

----
TRX (en confluence)-> mpj
Tener preguntas al final del día
Reconnect zoom: 6569815006

|-----------------------------------------------|
|                     Tareas                    |
|-----------------------------------------------|
|    Definir el alcance                         |
|-----------------------------------------------|
|    puntos de integracaios (llamadas)          |
|      -trx                                     |
|-----------------------------------------------|
|    establecer llamadas                        |
|-----------------------------------------------|
|    regas de negocio                           |
|      -rubro(toma) de decisiones               |
|      -establecer la proceso, logiaca          |
|      -usuarios involucrados                   |
|-----------------------------------------------|
|    path                                       |
|-----------------------------------------------|
|    flujos y subflujos                         |
|-----------------------------------------------|
