C:\Users\josec\repositories\personal_projects\liga-de-futbol\src\main\java\datos\EquipoDAOImpl.java
C:\Users\josec\repositories\personal_projects\liga-de-futbol\src\main\java\datos\IEquipoDAO.java
C:\Users\josec\repositories\personal_projects\liga-de-futbol\src\main\java\datos\Conexion.java
C:\Users\josec\repositories\personal_projects\liga-de-futbol\src\main\java\web\ServletControlador.java
C:\Users\josec\repositories\personal_projects\liga-de-futbol\src\main\java\dominio\Equipo.java
