<?xml version="1.0" encoding="UTF-8" standalone="no"?>
<!-- Created with Inkscape (http://www.inkscape.org/) -->

<svg
   xmlns:dc="http://purl.org/dc/elements/1.1/"
   xmlns:cc="http://creativecommons.org/ns#"
   xmlns:rdf="http://www.w3.org/1999/02/22-rdf-syntax-ns#"
   xmlns:svg="http://www.w3.org/2000/svg"
   xmlns="http://www.w3.org/2000/svg"
   xmlns:xlink="http://www.w3.org/1999/xlink"
   xmlns:sodipodi="http://sodipodi.sourceforge.net/DTD/sodipodi-0.dtd"
   xmlns:inkscape="http://www.inkscape.org/namespaces/inkscape"
   width="32"
   height="32"
   id="svg6311"
   version="1.1"
   inkscape:version="0.92.1 r15371"
   sodipodi:docname="canaima-logo 32x32.svg">
  <defs
     id="defs6313">
    <linearGradient
       inkscape:collect="always"
       xlink:href="#linearGradient7162"
       id="linearGradient6260"
       gradientUnits="userSpaceOnUse"
       gradientTransform="matrix(1.5233859,0,0,1.5233859,2499.7652,-3517.061)"
       x1="-1189.8101"
       y1="2728.8835"
       x2="-1187.4935"
       y2="2759.1086" />
    <linearGradient
       inkscape:collect="always"
       id="linearGradient7162">
      <stop
         style="stop-color:#a1e030;stop-opacity:1"
         offset="0"
         id="stop7164" />
      <stop
         style="stop-color:#556b2f;stop-opacity:1"
         offset="1"
         id="stop7166" />
    </linearGradient>
    <linearGradient
       inkscape:collect="always"
       xlink:href="#linearGradient7154"
       id="linearGradient6258"
       gradientUnits="userSpaceOnUse"
       gradientTransform="translate(1903.1946,-2060.5418)"
       x1="-1181.5977"
       y1="2741.823"
       x2="-1181.9034"
       y2="2747.4153" />
    <linearGradient
       inkscape:collect="always"
       id="linearGradient7154">
      <stop
         style="stop-color:#242424;stop-opacity:1"
         offset="0"
         id="stop7156" />
      <stop
         style="stop-color:#0e0e0e;stop-opacity:1"
         offset="1"
         id="stop7158" />
    </linearGradient>
    <linearGradient
       inkscape:collect="always"
       xlink:href="#linearGradient7043"
       id="linearGradient6256"
       gradientUnits="userSpaceOnUse"
       gradientTransform="translate(1879.4683,-1364.5722)"
       x1="-1156.3885"
       y1="2042.782"
       x2="-1188.7191"
       y2="2059.3843" />
    <linearGradient
       inkscape:collect="always"
       id="linearGradient7043">
      <stop
         style="stop-color:#e6e6e6;stop-opacity:1;"
         offset="0"
         id="stop7045" />
      <stop
         style="stop-color:#808080;stop-opacity:1"
         offset="1"
         id="stop7047" />
    </linearGradient>
    <linearGradient
       inkscape:collect="always"
       xlink:href="#linearGradient7043"
       id="linearGradient6254"
       gradientUnits="userSpaceOnUse"
       gradientTransform="translate(1879.4683,-1364.5722)"
       x1="-1156.3885"
       y1="2042.782"
       x2="-1188.7191"
       y2="2059.3843" />
    <linearGradient
       inkscape:collect="always"
       xlink:href="#linearGradient7043"
       id="linearGradient6252"
       gradientUnits="userSpaceOnUse"
       gradientTransform="translate(83.463368,372.72872)"
       x1="-1156.3885"
       y1="2042.782"
       x2="-1188.7191"
       y2="2059.3843" />
    <linearGradient
       y2="2059.3843"
       x2="-1188.7191"
       y1="2042.782"
       x1="-1156.3885"
       gradientTransform="translate(1879.4683,-1364.5722)"
       gradientUnits="userSpaceOnUse"
       id="linearGradient6309"
       xlink:href="#linearGradient7043"
       inkscape:collect="always" />
  </defs>
  <sodipodi:namedview
     id="base"
     pagecolor="#ffffff"
     bordercolor="#666666"
     borderopacity="1.0"
     inkscape:pageopacity="0.0"
     inkscape:pageshadow="2"
     inkscape:zoom="7.9195959"
     inkscape:cx="65.302973"
     inkscape:cy="47.427892"
     inkscape:document-units="px"
     inkscape:current-layer="layer1"
     showgrid="false"
     fit-margin-top="0"
     fit-margin-left="0"
     fit-margin-right="0"
     fit-margin-bottom="0"
     inkscape:window-width="1920"
     inkscape:window-height="1018"
     inkscape:window-x="-8"
     inkscape:window-y="-8"
     inkscape:window-maximized="1" />
  <metadata
     id="metadata6316">
    <rdf:RDF>
      <cc:Work
         rdf:about="">
        <dc:format>image/svg+xml</dc:format>
        <dc:type
           rdf:resource="http://purl.org/dc/dcmitype/StillImage" />
        <dc:title></dc:title>
      </cc:Work>
    </rdf:RDF>
  </metadata>
  <g
     inkscape:label="Capa 1"
     inkscape:groupmode="layer"
     id="layer1"
     transform="translate(-673.92058,-643.07521)">
    <path
       inkscape:connector-curvature="0"
       style="overflow:visible;fill:url(#linearGradient6260);fill-opacity:1;stroke-width:0.33009353"
       id="path6249"
       d="m 686.4892,643.21565 c -2.43346,0.0792 -3.17611,2.90098 -3.66786,4.83583 -0.41192,0.9145 1.09653,1.04961 0.98792,1.35901 -0.34002,0.9672 -2.86229,2.01895 -3.80511,3.86438 -1.21932,1.93577 -2.61962,3.84 -3.15585,6.1234 -0.30818,1.3127 -0.5699,3.65917 -0.48901,4.53481 0.23506,2.5465 0.5015,5.4289 2.60499,7.18825 1.9283,1.47815 3.48566,-1.13507 4.2632,-2.42096 0.85233,-1.83675 0.75118,-4.71975 2.35302,-6.17946 0.68674,-0.68537 1.19464,-1.23501 0.49312,-0.0579 -1.23714,2.69243 -0.91007,6.0483 -2.94379,8.36156 -0.68842,0.66023 -1.90698,2.0849 -0.31032,2.54557 1.51349,0.60662 3.19013,0.90337 4.71641,1.36542 1.00497,0.22881 4.21155,0.0838 2.07195,-1.38126 -0.66496,-0.37856 -3.36043,-1.38491 -1.3619,-1.17773 1.13857,-0.0167 2.2834,0.0259 3.41543,0.0152 0.27726,-1.21855 -2.42036,-1.11649 -3.35252,-1.19769 -1.84436,-0.13405 -1.44142,-1.84314 -0.68125,-3.27908 0.84288,-1.5924 1.91778,-3.02179 2.50627,-4.71519 0.84959,-1.41538 1.22282,-4.189 -0.8732,-4.66994 -1.99457,-0.28929 -3.88479,0.89515 -5.46272,1.99289 -0.73518,0.45261 -2.58487,2.50963 -1.23835,0.71341 1.33189,-1.71092 2.8664,-3.8234 5.20769,-3.9995 1.82288,9.9e-4 3.5012,0.84441 5.19627,1.38537 1.96837,0.3455 4.01945,-1.31286 5.69244,-2.0354 1.77276,-0.48062 3.18509,0.335 4.92937,-0.11425 -0.39913,-1.63292 -2.93892,-2.34023 -4.2376,-2.04362 -1.71031,0.56411 -3.28291,1.1078 -5.34039,1.29685 -1.43153,0.0411 -2.46941,-0.62717 -3.6907,-1.25694 -0.94419,-0.71401 -2.01392,-1.23653 -2.96695,-1.92861 0.43934,-0.94313 1.92343,-0.25547 1.88382,-1.73772 0.32189,-0.85157 1.40699,-0.75895 0.70213,-1.97294 -0.33195,-1.35581 1.35809,-2.58793 0.22256,-3.9445 -0.66008,-1.33845 -2.378,-1.38872 -3.66907,-1.46337 v 1.5e-4 z"
       sodipodi:nodetypes="ccccsscccccccccccsccccccccccccccccc" />
  </g>
</svg>
