<?xml version="1.0" encoding="UTF-8" standalone="no"?>
<!-- Created with Inkscape (http://www.inkscape.org/) -->

<svg
   xmlns:dc="http://purl.org/dc/elements/1.1/"
   xmlns:cc="http://creativecommons.org/ns#"
   xmlns:rdf="http://www.w3.org/1999/02/22-rdf-syntax-ns#"
   xmlns:svg="http://www.w3.org/2000/svg"
   xmlns="http://www.w3.org/2000/svg"
   xmlns:xlink="http://www.w3.org/1999/xlink"
   xmlns:sodipodi="http://sodipodi.sourceforge.net/DTD/sodipodi-0.dtd"
   xmlns:inkscape="http://www.inkscape.org/namespaces/inkscape"
   width="40"
   height="40"
   id="svg5038"
   version="1.1"
   inkscape:version="0.92.1 r15371"
   sodipodi:docname="grid-selection-unchecked.svg">
  <defs
     id="defs5040">
    <linearGradient
       inkscape:collect="always"
       xlink:href="#linearGradient5872"
       id="linearGradient5891"
       gradientUnits="userSpaceOnUse"
       x1="205.84143"
       y1="246.7094"
       x2="206.74803"
       y2="231.24142" />
    <linearGradient
       inkscape:collect="always"
       id="linearGradient5872">
      <stop
         style="stop-color:#13508e;stop-opacity:1;"
         offset="0"
         id="stop5874" />
      <stop
         style="stop-color:#1862af;stop-opacity:1"
         offset="1"
         id="stop5876" />
    </linearGradient>
    <inkscape:path-effect
       effect="spiro"
       id="path-effect5837"
       is_visible="true" />
    <inkscape:path-effect
       effect="spiro"
       id="path-effect5012"
       is_visible="true" />
    <inkscape:path-effect
       effect="spiro"
       id="path-effect5884"
       is_visible="true" />
    <linearGradient
       inkscape:collect="always"
       xlink:href="#linearGradient10354-2-9-1"
       id="linearGradient15341-5"
       gradientUnits="userSpaceOnUse"
       gradientTransform="translate(-1609.9926,-78.958432)"
       x1="1205.5752"
       y1="-186.45331"
       x2="1205.5752"
       y2="-202.34555" />
    <linearGradient
       id="linearGradient10354-2-9-1"
       inkscape:collect="always">
      <stop
         id="stop10356-2-8-2"
         offset="0"
         style="stop-color:#bcbfb8;stop-opacity:1" />
      <stop
         id="stop10358-2-6-2"
         offset="1"
         style="stop-color:#ffffff;stop-opacity:1" />
    </linearGradient>
    <linearGradient
       inkscape:collect="always"
       xlink:href="#linearGradient10332-5-3-3"
       id="linearGradient15343-1"
       gradientUnits="userSpaceOnUse"
       gradientTransform="matrix(0.84941206,0,0,0.84794288,-623.98415,-483.16392)"
       x1="260.92538"
       y1="233.77748"
       x2="260.92538"
       y2="248.97633" />
    <linearGradient
       inkscape:collect="always"
       id="linearGradient10332-5-3-3">
      <stop
         style="stop-color:#d3d7cf;stop-opacity:1"
         offset="0"
         id="stop10334-5-3-1" />
      <stop
         style="stop-color:#8f9985;stop-opacity:1"
         offset="1"
         id="stop10336-29-3-4" />
    </linearGradient>
    <linearGradient
       y2="1106.5294"
       x2="808"
       y1="1040.7369"
       x1="806.39526"
       gradientTransform="matrix(0.04728153,0,0,0.52063887,144.29163,-314.78125)"
       gradientUnits="userSpaceOnUse"
       id="linearGradient5726"
       xlink:href="#linearGradient85841-7-0"
       inkscape:collect="always" />
    <linearGradient
       inkscape:collect="always"
       id="linearGradient85841-7-0">
      <stop
         style="stop-color:#242424;stop-opacity:1"
         offset="0"
         id="stop85843-4-8" />
      <stop
         id="stop85845-0-5"
         offset="0.63381755"
         style="stop-color:#101010;stop-opacity:1;" />
      <stop
         style="stop-color:#262626;stop-opacity:1"
         offset="1"
         id="stop85847-7-3" />
    </linearGradient>
    <linearGradient
       y2="1106.5294"
       x2="808"
       y1="1040.7369"
       x1="806.39526"
       gradientTransform="matrix(0.04849388,0,0,0.53398858,-4.8290974,-542.54487)"
       gradientUnits="userSpaceOnUse"
       id="linearGradient5036"
       xlink:href="#linearGradient85841-7-0"
       inkscape:collect="always" />
    <linearGradient
       y2="1106.5294"
       x2="808"
       y1="1040.7369"
       x1="806.39526"
       gradientTransform="matrix(0.04728153,0,0,0.52063887,344.29163,-313.78125)"
       gradientUnits="userSpaceOnUse"
       id="linearGradient5772"
       xlink:href="#linearGradient85841-7-0-9"
       inkscape:collect="always" />
    <linearGradient
       id="linearGradient85841-7-0-9">
      <stop
         style="stop-color:#242424;stop-opacity:1"
         offset="0"
         id="stop85843-4-8-3" />
      <stop
         id="stop85845-0-5-1"
         offset="0.63381755"
         style="stop-color:#101010;stop-opacity:1;" />
      <stop
         style="stop-color:#262626;stop-opacity:1"
         offset="1"
         id="stop85847-7-3-3" />
    </linearGradient>
    <linearGradient
       inkscape:collect="always"
       xlink:href="#linearGradient10332-5-3-3-6"
       id="linearGradient15343-1-3"
       gradientUnits="userSpaceOnUse"
       gradientTransform="matrix(0.84941206,0,0,0.84794288,-623.98415,-483.16392)"
       x1="260.92538"
       y1="233.77748"
       x2="260.92538"
       y2="248.97633" />
    <linearGradient
       inkscape:collect="always"
       id="linearGradient10332-5-3-3-6">
      <stop
         style="stop-color:#d7bad9;stop-opacity:1"
         offset="0"
         id="stop10334-5-3-1-7" />
      <stop
         style="stop-color:#d7bad9;stop-opacity:1"
         offset="1"
         id="stop10336-29-3-4-5" />
    </linearGradient>
  </defs>
  <sodipodi:namedview
     id="base"
     pagecolor="#ffffff"
     bordercolor="#666666"
     borderopacity="1.0"
     inkscape:pageopacity="0.0"
     inkscape:pageshadow="2"
     inkscape:zoom="10.71875"
     inkscape:cx="19.161072"
     inkscape:cy="10.006827"
     inkscape:current-layer="layer1"
     showgrid="true"
     inkscape:grid-bbox="true"
     inkscape:document-units="px"
     inkscape:window-width="1280"
     inkscape:window-height="967"
     inkscape:window-x="0"
     inkscape:window-y="30"
     inkscape:window-maximized="1"
     showguides="true"
     inkscape:guide-bbox="true"
     inkscape:snap-global="false">
    <sodipodi:guide
       position="8.2099125,12.501458"
       orientation="1,0"
       id="guide867"
       inkscape:locked="false" />
  </sodipodi:namedview>
  <metadata
     id="metadata5043">
    <rdf:RDF>
      <cc:Work
         rdf:about="">
        <dc:format>image/svg+xml</dc:format>
        <dc:type
           rdf:resource="http://purl.org/dc/dcmitype/StillImage" />
        <dc:title />
      </cc:Work>
    </rdf:RDF>
  </metadata>
  <g
     id="layer1"
     inkscape:label="Layer 1"
     inkscape:groupmode="layer"
     transform="translate(0,-8)">
    <g
       style="display:inline;enable-background:new"
       id="g15291-9"
       transform="matrix(2.0481319,0,0,2.0481319,-949.93476,-333.67859)"
       inkscape:export-filename="/home/jimmac/SparkleShare/gnome-mockups/boxes/interactive/img/checkbox-on.png"
       inkscape:export-xdpi="90"
       inkscape:export-ydpi="90">
      <g
         style="enable-background:new"
         id="g16853-4"
         transform="translate(877.50354,-102.83507)">
        <rect
           ry="0.80653393"
           rx="0.80653393"
           y="-284.86218"
           x="-409.50739"
           height="11.023263"
           width="11.042357"
           id="rect6506-6"
           style="color:#000000;display:inline;overflow:visible;visibility:visible;fill:#ffffff;fill-opacity:1;fill-rule:nonzero;stroke:url(#linearGradient15343-1-3);stroke-width:0.48824981;stroke-opacity:1;marker:none;enable-background:accumulate"
           transform="scale(1,-1)" />
      </g>
    </g>
  </g>
</svg>
