<?xml version="1.0" encoding="UTF-8" standalone="no"?>
<!-- Created with Inkscape (http://www.inkscape.org/) -->

<svg
   xmlns:dc="http://purl.org/dc/elements/1.1/"
   xmlns:cc="http://creativecommons.org/ns#"
   xmlns:rdf="http://www.w3.org/1999/02/22-rdf-syntax-ns#"
   xmlns:svg="http://www.w3.org/2000/svg"
   xmlns="http://www.w3.org/2000/svg"
   xmlns:sodipodi="http://sodipodi.sourceforge.net/DTD/sodipodi-0.dtd"
   xmlns:inkscape="http://www.inkscape.org/namespaces/inkscape"
   width="12.077437"
   height="12.008709"
   id="svg4959"
   version="1.1"
   inkscape:version="0.92.1 r15371"
   sodipodi:docname="menuitem-radio-checked.svg">
  <defs
     id="defs4961" />
  <sodipodi:namedview
     id="base"
     pagecolor="#ffffff"
     bordercolor="#666666"
     borderopacity="1.0"
     inkscape:pageopacity="0.0"
     inkscape:pageshadow="2"
     inkscape:zoom="24.253762"
     inkscape:cx="1.520317"
     inkscape:cy="5.5190856"
     inkscape:document-units="px"
     inkscape:current-layer="layer1"
     showgrid="false"
     fit-margin-top="0"
     fit-margin-left="0"
     fit-margin-right="0"
     fit-margin-bottom="0"
     inkscape:window-width="1280"
     inkscape:window-height="967"
     inkscape:window-x="0"
     inkscape:window-y="30"
     inkscape:window-maximized="1" />
  <metadata
     id="metadata4964">
    <rdf:RDF>
      <cc:Work
         rdf:about="">
        <dc:format>image/svg+xml</dc:format>
        <dc:type
           rdf:resource="http://purl.org/dc/dcmitype/StillImage" />
        <dc:title />
      </cc:Work>
    </rdf:RDF>
  </metadata>
  <g
     inkscape:label="Layer 1"
     inkscape:groupmode="layer"
     id="layer1"
     transform="translate(-398.2133,-533.50504)">
    <path
       style="color:#000000;fill:#3194b5;fill-opacity:1;fill-rule:nonzero;stroke:none;stroke-width:0.95535719;marker:none;visibility:visible;display:inline;overflow:visible;enable-background:accumulate"
       d="m 407.2133,541.01375 c 0,1.93299 -1.567,3.5 -3.5,3.5 -1.93299,0 -3.5,-1.56701 -3.5,-3.5 0,-1.933 1.56701,-3.5 3.5,-3.5 1.933,0 3.5,1.567 3.5,3.5 z"
       id="path4945"
       inkscape:connector-curvature="0" />
  </g>
</svg>
