{
  "info": {
    "_postman_id": "188ce3a3-0d9b-4bc5-b378-982a69b450f3",
    "name": "LIG_Backend_Exam",
    "schema": "https://schema.getpostman.com/json/collection/v2.1.0/collection.json"
  },
  "item": [
    {
      "name": "Articles API",
      "item": [
        {
          "name": "List Articles",
          "request": {
            "method": "GET",
            "header": [],
            "url": {
              "raw": "http://localhost:8000/articles/",
              "protocol": "http",
              "host": [
                "localhost"
              ],
              "port": "8000",
              "path": [
                "articles",
                ""
              ]
            }
          },
          "response": []
        },
        {
          "name": "Create Article",
          "request": {
            "method": "POST",
            "header": [],
            "body": {
              "mode": "raw",
              "raw": "{\n    \"title\": \"Meet Django\",\n    \"slug\": \"meet-django\",\n    \"content\": \"Django is a high-level Python Web framework that encourages rapid development and clean, pragmatic design. Built by experienced developers, it takes care of much of the hassle of Web development, so you can focus on writing your app without needing to reinvent the wheel. It\u2019s free and open source.\"\n}",
              "options": {
                "raw": {
                  "language": "json"
                }
              }
            },
            "url": {
              "raw": "http://localhost:8000/articles/",
              "protocol": "http",
              "host": [
                "localhost"
              ],
              "port": "8000",
              "path": [
                "articles",
                ""
              ]
            }
          },
          "response": []
        },
        {
          "name": "View Article",
          "request": {
            "method": "GET",
            "header": [],
            "url": {
              "raw": "http://localhost:8000/articles/1/",
              "protocol": "http",
              "host": [
                "localhost"
              ],
              "port": "8000",
              "path": [
                "articles",
                "1",
                ""
              ]
            }
          },
          "response": []
        },
        {
          "name": "Update Article",
          "request": {
            "method": "PUT",
            "header": [],
            "body": {
              "mode": "raw",
              "raw": "{\n    \"title\": \"What is Django?\",\n    \"slug\": \"what-is-django\",\n    \"content\": \"Django is a high-level Python Web framework that encourages rapid development and clean, pragmatic design. Built by experienced developers, it takes care of much of the hassle of Web development, so you can focus on writing your app without needing to reinvent the wheel. It\u2019s free and open source.\"\n}",
              "options": {
                "raw": {
                  "language": "json"
                }
              }
            },
            "url": {
              "raw": "http://localhost:8000/articles/1/",
              "protocol": "http",
              "host": [
                "localhost"
              ],
              "port": "8000",
              "path": [
                "articles",
                "1",
                ""
              ]
            }
          },
          "response": []
        },
        {
          "name": "Patch Article",
          "request": {
            "method": "PATCH",
            "header": [],
            "body": {
              "mode": "raw",
              "raw": "{\n    \"content\": \"Django makes it easier to build better Web apps more quickly and with less code.\"\n}",
              "options": {
                "raw": {
                  "language": "json"
                }
              }
            },
            "url": {
              "raw": "http://localhost:8000/articles/1/",
              "protocol": "http",
              "host": [
                "localhost"
              ],
              "port": "8000",
              "path": [
                "articles",
                "1",
                ""
              ]
            }
          },
          "response": []
        },
        {
          "name": "Delete Article",
          "request": {
            "method": "DELETE",
            "header": [],
            "url": {
              "raw": "http://localhost:8000/articles/1/",
              "protocol": "http",
              "host": [
                "localhost"
              ],
              "port": "8000",
              "path": [
                "articles",
                "1",
                ""
              ]
            }
          },
          "response": []
        }
      ],
      "auth": {
        "type": "oauth2",
        "oauth2": [
          {
            "key": "accessToken",
            "value": "",
            "type": "string"
          },
          {
            "key": "tokenType",
            "value": "Bearer",
            "type": "string"
          },
          {
            "key": "addTokenTo",
            "value": "header",
            "type": "string"
          }
        ]
      },
      "event": [
        {
          "listen": "prerequest",
          "script": {
            "id": "4d92bf3d-fcaf-4e2a-9d8b-a8f38adb4d30",
            "type": "text/javascript",
            "exec": [
              ""
            ]
          }
        },
        {
          "listen": "test",
          "script": {
            "id": "4d04d9a4-a97a-4c46-a165-ac157082cf7d",
            "type": "text/javascript",
            "exec": [
              ""
            ]
          }
        }
      ],
      "protocolProfileBehavior": {}
    },
    {
      "name": "Register",
      "request": {
        "method": "POST",
        "header": [],
        "body": {
          "mode": "raw",
          "raw": "{\n    \"username\": \"gvanrossum\",\n    \"email\": \"python-creator@localhost\",\n    \"password\": \"ultraelectromagnetictop\",\n    \"first_name\": \"Guido\",\n    \"last_name\": \"Van Rossum\"\n}",
          "options": {
            "raw": {
              "language": "json"
            }
          }
        },
        "url": {
          "raw": "http://localhost:8000/users/",
          "protocol": "http",
          "host": [
            "localhost"
          ],
          "port": "8000",
          "path": [
            "users",
            ""
          ]
        }
      },
      "response": []
    }
  ],
  "protocolProfileBehavior": {}
}
