[{
        "active": true,
        "index": "0",
        "date": "14/09/2022",
        "title": "Présentation",
        "path": "./cours/00-presentation",
        "done": "true",
        "resources": []
    },
    {
        "active": true,
        "index": "1",
        "date": "14/09/2022",
        "title": "L'ordinateur",
        "path": "./cours/01-pc",
        "done": "true",
        "resources": []
    },
    {
        "active": true,
        "index": "2",
        "date": "21/09/2022",
        "title": "Les systèmes d'exploitation",
        "path": "./cours/02-os",
        "done": "true",
        "resources": []
    },
    {
        "active": true,
        "index": "3",
        "date": "28/09/2022",
        "title": "Les programmes",
        "path": "./cours/03-softwares",
        "done": "true",
        "resources": []
    },
    {
        "active": true,
        "index": "4",
        "date": "05/10/2022",
        "title": "Le dessin vectoriel",
        "path": "./cours/04-inkscape",
        "done": "true",
        "resources": []
    },
    {
        "active": true,
        "index": "5",
        "date": "09/11/2022",
        "title": "L'électronique",
        "path": "./cours/05-electronique",
        "done": "false",
        "resources": []
    }
]