%YAML 1.1
%TAG !u! tag:unity3d.com,2011:
--- !u!114 &11400000
MonoBehaviour:
  m_ObjectHideFlags: 0
  m_CorrespondingSourceObject: {fileID: 0}
  m_PrefabInstance: {fileID: 0}
  m_PrefabAsset: {fileID: 0}
  m_GameObject: {fileID: 0}
  m_Enabled: 1
  m_EditorHideFlags: 0
  m_Script: {fileID: 11500000, guid: 3137f95f3dba3f840aecf91efb493ad8, type: 3}
  m_Name: MainMenu
  m_EditorClassIdentifier: 
  soundType: 0
  clip: {fileID: 8300000, guid: 30a7a4464954a6548a8ee20f6afddc67, type: 3}
  volume: 0.35
  loop: 1
