%YAML 1.1
%TAG !u! tag:unity3d.com,2011:
--- !u!114 &11400000
MonoBehaviour:
  m_ObjectHideFlags: 0
  m_CorrespondingSourceObject: {fileID: 0}
  m_PrefabInstance: {fileID: 0}
  m_PrefabAsset: {fileID: 0}
  m_GameObject: {fileID: 0}
  m_Enabled: 1
  m_EditorHideFlags: 0
  m_Script: {fileID: 11500000, guid: e9f8a6214b851244b8592d67c728cacb, type: 3}
  m_Name: Kick
  m_EditorClassIdentifier: 
  soundType: 2
  clip: {fileID: 8300000, guid: 14fc59f0684ad88419d878c9aa84066d, type: 3}
  volume: 1
  loop: 0
