V3 19
FL C:/.Xilinx/ensayo1/ejemplo1.vhd 2022/05/17.12:57:23 P.20131013
EN work/ejemplo1 1652810245 FL C:/.Xilinx/ensayo1/ejemplo1.vhd \
      PB ieee/std_logic_1164 1381692176
AR work/ejemplo1/Behavioral 1652810246 \
      FL C:/.Xilinx/ensayo1/ejemplo1.vhd EN work/ejemplo1 1652810245
FL C:/.Xilinx/ensayo1/Lampara.vhd 2022/05/17.20:15:01 P.20131013
EN work/Lampara 1652840351 FL C:/.Xilinx/ensayo1/Lampara.vhd \
      PB ieee/std_logic_1164 1381692176
AR work/Lampara/Behavioral 1652840352 \
      FL C:/.Xilinx/ensayo1/Lampara.vhd EN work/Lampara 1652840351
FL C:/.Xilinx/ensayo1/Proyecto.vhd 2022/05/17.19:48:05 P.20131013
EN work/entidad 1652834903 FL C:/.Xilinx/ensayo1/Proyecto.vhd \
      PB ieee/std_logic_1164 1381692176
AR work/entidad/Behavioral 1652834904 \
      FL C:/.Xilinx/ensayo1/Proyecto.vhd EN work/entidad 1652834903
FL C:/.Xilinx/ensayo1/Robot.vhd 2022/05/17.19:51:07 P.20131013
EN work/Robot 1652835073 FL C:/.Xilinx/ensayo1/Robot.vhd PB ieee/std_logic_1164 1381692176
AR work/Robot/Behavioral 1652835074 \
      FL C:/.Xilinx/ensayo1/Robot.vhd EN work/Robot 1652835073
FL C:/Users/Jordy/Desktop/estadistica/ensayo1/ensayo1/Ejerciocio26.vhd 2022/05/18.09:51:38 P.20131013
EN work/Ejerciocio26 0 \
      FL C:/Users/Jordy/Desktop/estadistica/ensayo1/ensayo1/Ejerciocio26.vhd \
      PB ieee/std_logic_1164 1381692176
AR work/Ejerciocio26/Behavioral 0 \
      FL C:/Users/Jordy/Desktop/estadistica/ensayo1/ensayo1/Ejerciocio26.vhd \
      EN work/Ejerciocio26 0 CP inout
FL C:/Users/Jordy/Desktop/estadistica/ensayo1/ensayo1/Lampara.vhd 2022/05/18.17:04:05 P.20131013
EN work/Codigo_Morse 0 \
      FL C:/Users/Jordy/Desktop/estadistica/ensayo1/ensayo1/Lampara.vhd \
      PB ieee/std_logic_1164 1381692176
AR work/Codigo_Morse/Behavioral 0 \
      FL C:/Users/Jordy/Desktop/estadistica/ensayo1/ensayo1/Lampara.vhd \
      EN work/Codigo_Morse 0
