AR entidad behavioral C:/.Xilinx/ensayo1/Proyecto.vhd sub00/vhpl03 1652834904
AR ejemplo1 behavioral C:/.Xilinx/ensayo1/ejemplo1.vhd sub00/vhpl01 1652810246
EN robot NULL C:/.Xilinx/ensayo1/Robot.vhd sub00/vhpl04 1652835073
EN ejerciocio26 NULL C:/Users/Jordy/Desktop/estadistica/ensayo1/ensayo1/Ejerciocio26.vhd sub00/vhpl08 1652913745
EN entidad NULL C:/.Xilinx/ensayo1/Proyecto.vhd sub00/vhpl02 1652834903
AR robot behavioral C:/.Xilinx/ensayo1/Robot.vhd sub00/vhpl05 1652835074
EN lampara NULL C:/.Xilinx/ensayo1/Lampara.vhd sub00/vhpl06 1652840351
EN ejemplo1 NULL C:/.Xilinx/ensayo1/ejemplo1.vhd sub00/vhpl00 1652812484
AR lampara behavioral C:/.Xilinx/ensayo1/Lampara.vhd sub00/vhpl07 1652840352
