{
  "project_info": {
    "project_number": "633010812637",
    "project_id": "geoyou",
    "storage_bucket": "geoyou.appspot.com"
  },
  "client": [
    {
      "client_info": {
        "mobilesdk_app_id": "1:633010812637:android:e716225765cd67a3fc0d34",
        "android_client_info": {
          "package_name": "com.itb.geoyou"
        }
      },
      "oauth_client": [
        {
          "client_id": "633010812637-gl8fhu7foeme8bqdbfvndn08vjqiu90m.apps.googleusercontent.com",
          "client_type": 1,
          "android_info": {
            "package_name": "com.itb.geoyou",
            "certificate_hash": "8830c8bdc0561f1ff7a6deec992c4efb42d93f11"
          }
        },
        {
          "client_id": "633010812637-rv99ubs99e1thmbjdg5l48h4ttobosjl.apps.googleusercontent.com",
          "client_type": 3
        }
      ],
      "api_key": [
        {
          "current_key": "AIzaSyBZNdPh-pyBcg71X8tY473LA0nATgZVpuY"
        }
      ],
      "services": {
        "appinvite_service": {
          "other_platform_oauth_client": [
            {
              "client_id": "633010812637-rv99ubs99e1thmbjdg5l48h4ttobosjl.apps.googleusercontent.com",
              "client_type": 3
            }
          ]
        }
      }
    }
  ],
  "configuration_version": "1"
}