{
    "exportFormatVersion": 2,
    "exportTime": "2018-06-22 09:26:32",
    "containerVersion": {
        "path": "accounts/1573125716/containers/7169281/versions/0",
        "accountId": "1573125716",
        "containerId": "7169281",
        "containerVersionId": "0",
        "container": {
            "path": "accounts/1573125716/containers/7169281",
            "accountId": "1573125716",
            "containerId": "7169281",
            "name": "Test",
            "publicId": "GTM-KSJG7MH",
            "usageContext": [
                "WEB"
            ],
            "fingerprint": "1529396450548",
            "tagManagerUrl": "https://tagmanager.google.com/#/container/accounts/1573125716/containers/7169281/workspaces?apiLink=container"
        },
        "tag": [
            {
                "accountId": "1573125716",
                "containerId": "7169281",
                "tagId": "2",
                "name": "Clafoutis",
                "type": "html",
                "parameter": [
                    {
                        "type": "TEMPLATE",
                        "key": "html",
                        "value": "<script type=\"text/javascript\">\nclafoutis.services.push({\n  'code': 'analytics'\n});\nclafoutis.services.push({\n  'code': 'recaptcha',\n  'category': 'api',\n  'title': 'reCAPTCHA',\n  'uri': 'http://www.google.com/policies/privacy/',\n  'cookies': ['nid']\n});\n  \nclafoutis.run();\n</script>"
                    },
                    {
                        "type": "BOOLEAN",
                        "key": "supportDocumentWrite",
                        "value": "false"
                    }
                ],
                "fingerprint": "1529396426671",
                "firingTriggerId": [
                    "2147479553"
                ],
                "tagFiringOption": "ONCE_PER_EVENT"
            },
            {
                "accountId": "1573125716",
                "containerId": "7169281",
                "tagId": "1",
                "name": "Universal Analytics",
                "type": "ua",
                "parameter": [
                    {
                        "type": "BOOLEAN",
                        "key": "overrideGaSettings",
                        "value": "false"
                    },
                    {
                        "type": "TEMPLATE",
                        "key": "trackType",
                        "value": "TRACK_PAGEVIEW"
                    },
                    {
                        "type": "TEMPLATE",
                        "key": "gaSettings",
                        "value": "{{Paramètres Google Analytics}}"
                    }
                ],
                "fingerprint": "1527235179667",
                "firingTriggerId": [
                    "2147479553"
                ],
                "blockingTriggerId": [
                    "11"
                ],
                "tagFiringOption": "ONCE_PER_EVENT"
            }
        ],
        "trigger": [
            {
                "accountId": "1573125716",
                "containerId": "7169281",
                "triggerId": "11",
                "name": "Bloqueur Analytics",
                "type": "CUSTOM_EVENT",
                "customEventFilter": [
                    {
                        "type": "MATCH_REGEX",
                        "parameter": [
                            {
                                "type": "TEMPLATE",
                                "key": "arg0",
                                "value": "{{_event}}"
                            },
                            {
                                "type": "TEMPLATE",
                                "key": "arg1",
                                "value": ".*"
                            }
                        ]
                    }
                ],
                "filter": [
                    {
                        "type": "CONTAINS",
                        "parameter": [
                            {
                                "type": "TEMPLATE",
                                "key": "arg0",
                                "value": "{{clafoutis}}"
                            },
                            {
                                "type": "TEMPLATE",
                                "key": "arg1",
                                "value": "analytics"
                            },
                            {
                                "type": "BOOLEAN",
                                "key": "negate",
                                "value": "true"
                            }
                        ]
                    }
                ],
                "fingerprint": "1527235419070"
            }
        ],
        "variable": [
            {
                "accountId": "1573125716",
                "containerId": "7169281",
                "variableId": "1",
                "name": "Paramètres Google Analytics",
                "type": "gas",
                "parameter": [
                    {
                        "type": "TEMPLATE",
                        "key": "cookieDomain",
                        "value": "auto"
                    },
                    {
                        "type": "BOOLEAN",
                        "key": "doubleClick",
                        "value": "false"
                    },
                    {
                        "type": "BOOLEAN",
                        "key": "setTrackerName",
                        "value": "false"
                    },
                    {
                        "type": "BOOLEAN",
                        "key": "useDebugVersion",
                        "value": "false"
                    },
                    {
                        "type": "BOOLEAN",
                        "key": "useHashAutoLink",
                        "value": "false"
                    },
                    {
                        "type": "BOOLEAN",
                        "key": "decorateFormsAutoLink",
                        "value": "false"
                    },
                    {
                        "type": "BOOLEAN",
                        "key": "enableLinkId",
                        "value": "false"
                    },
                    {
                        "type": "BOOLEAN",
                        "key": "enableEcommerce",
                        "value": "false"
                    },
                    {
                        "type": "TEMPLATE",
                        "key": "trackingId",
                        "value": "UA-8562726-3"
                    }
                ],
                "fingerprint": "1527497524739"
            },
            {
                "accountId": "1573125716",
                "containerId": "7169281",
                "variableId": "6",
                "name": "clafoutis",
                "type": "k",
                "parameter": [
                    {
                        "type": "BOOLEAN",
                        "key": "decodeCookie",
                        "value": "false"
                    },
                    {
                        "type": "TEMPLATE",
                        "key": "name",
                        "value": "clafoutis"
                    }
                ],
                "fingerprint": "1527263212617"
            }
        ],
        "builtInVariable": [
            {
                "accountId": "1573125716",
                "containerId": "7169281",
                "type": "PAGE_URL",
                "name": "Page URL"
            },
            {
                "accountId": "1573125716",
                "containerId": "7169281",
                "type": "PAGE_HOSTNAME",
                "name": "Page Hostname"
            },
            {
                "accountId": "1573125716",
                "containerId": "7169281",
                "type": "PAGE_PATH",
                "name": "Page Path"
            },
            {
                "accountId": "1573125716",
                "containerId": "7169281",
                "type": "REFERRER",
                "name": "Referrer"
            },
            {
                "accountId": "1573125716",
                "containerId": "7169281",
                "type": "EVENT",
                "name": "Event"
            }
        ],
        "fingerprint": "0",
        "tagManagerUrl": "https://tagmanager.google.com/#/versions/accounts/1573125716/containers/7169281/versions/0?apiLink=version"
    }
}