<svg width="48" height="48" viewBox="0 0 48 48" fill="none" xmlns="http://www.w3.org/2000/svg">
<path d="M31.5142 38.3616H9.86624C8.63626 38.3792 7.41598 38.1418 6.28226 37.6645C5.14854 37.1871 4.12597 36.4802 3.27894 35.5882C2.43191 34.6961 1.7788 33.6384 1.36073 32.4815C0.942669 31.3246 0.768718 30.0937 0.849837 28.8662C0.930956 27.6388 1.26539 26.4415 1.83207 25.3497C2.39874 24.2579 3.18538 23.2953 4.14244 22.5225C5.09949 21.7497 6.20621 21.1835 7.39288 20.8595C8.57956 20.5355 9.82047 20.4608 11.0374 20.64C11.2051 17.8754 12.3424 15.2584 14.2492 13.2496C16.1561 11.2408 18.7103 9.9688 21.4625 9.65746C24.2146 9.34612 26.9884 10.0154 29.2958 11.5475C31.6033 13.0795 33.2964 15.3763 34.0774 18.0336C34.9365 17.8107 35.8203 17.6978 36.7078 17.6976C38.0656 17.6976 39.4101 17.9651 40.6645 18.4847C41.9189 19.0042 43.0587 19.7658 44.0188 20.7259C44.9788 21.686 45.7404 22.8258 46.26 24.0802C46.7796 25.3346 47.047 26.6791 47.047 28.0368C47.047 29.3946 46.7796 30.7391 46.26 31.9935C45.7404 33.2479 44.9788 34.3877 44.0188 35.3477C43.0587 36.3078 41.9189 37.0694 40.6645 37.589C39.4101 38.1086 38.0656 38.376 36.7078 38.376" stroke="#171321" stroke-width="1.27982" stroke-linecap="round" stroke-linejoin="round"/>
</svg>
