<svg width="24" height="25" viewBox="0 0 24 25" fill="none" xmlns="http://www.w3.org/2000/svg">
<g clip-path="url(#clip0_442_1172)">
<path d="M15.9999 19.9995H7.74989V19.8695C7.74989 18.912 7.28739 18.0145 6.51489 17.447C4.13239 15.692 2.62239 12.822 2.75739 9.60453C2.95739 4.79703 6.90739 0.897034 11.7174 0.754534C16.9549 0.597034 21.2499 4.79703 21.2499 9.99953C21.2499 13.0645 19.7574 15.7795 17.4624 17.462C16.6874 18.0295 16.2499 18.9495 16.2499 19.9095V21.247C16.2499 22.9045 14.9074 24.247 13.2499 24.247H7.74989V21.997" stroke="#171321" stroke-width="0.5" stroke-miterlimit="10"/>
<path d="M8.80762 11.027L13.4926 5.37451L12.4251 9.72201H15.1926L10.5076 15.3745L11.5751 11.027H8.80762Z" stroke="#171321" stroke-width="0.5" stroke-miterlimit="10"/>
</g>
<defs>
<clipPath id="clip0_442_1172">
<rect width="24" height="24" fill="white" transform="translate(0 0.5)"/>
</clipPath>
</defs>
</svg>
