<svg width="128" height="167" viewBox="0 0 128 167" fill="none" xmlns="http://www.w3.org/2000/svg">
<path d="M11.0298 123.318L64.817 150.667L116.562 123.318V16.3708H11.0298V123.318Z" fill="white"/>
<path d="M117.651 16.779L9.94043 125.223L65.7702 152.845L117.651 126.312V16.779Z" fill="#F2F3F2"/>
<path d="M7.48938 52.02V125.631L9.39576 126.584L63.183 153.933L64.817 154.749L66.4511 153.933L118.332 126.584L120.238 125.631V12.8331H7.48938V52.02ZM11.0298 123.59V16.3708H116.698V123.59L64.817 150.94L11.0298 123.59Z" fill="#DCDEDC"/>
<path d="M63.8638 18.1396C64.4085 18.1396 64.9532 18.1396 65.4979 18.2757L63.8638 21.4052C61.4128 21.2691 59.2341 23.1741 59.0979 25.6232C58.9617 28.0724 60.8681 30.2495 63.3192 30.3855H63.8638C64.9532 30.3855 66.0426 29.9773 66.8596 29.297L68.6298 32.2904C67.2681 33.2429 65.6341 33.7872 63.8638 33.7872C59.5064 33.9232 55.8298 30.6577 55.6936 26.3036C55.5575 21.9495 58.8256 18.2757 63.183 18.1396H63.8638ZM69.4468 24.8068L71.4894 28.2085L69.4468 31.4741L67.5404 28.2085H63.5915L65.6341 24.8068H69.4468ZM66.1787 23.5823C66.1787 23.038 66.3149 22.4937 66.5873 22.0855C66.8596 21.6773 67.4043 21.2691 67.8128 20.997L68.0851 20.8609C68.6298 20.5888 68.766 20.4527 68.766 20.1806C68.766 19.9085 68.3575 19.6363 68.0851 19.6363C67.5404 19.6363 67.1319 19.9085 66.8596 20.4527L66.1787 19.7724C66.3149 19.5003 66.5872 19.2282 66.8596 18.956C67.2681 18.6839 67.6766 18.6839 68.0851 18.6839C68.4936 18.6839 69.0383 18.82 69.3107 19.0921C69.583 19.3642 69.8553 19.7724 69.8553 20.1806C69.8553 20.8609 69.4468 21.4052 68.6298 21.6773L68.2213 21.9495C67.8128 22.2216 67.5404 22.3577 67.4043 22.7659H69.8553V23.7183L66.1787 23.5823ZM63.8638 40.5904L76.8 33.2429V12.8331H50.7915V33.1068L63.8638 40.5904Z" fill="#FF492C"/>
<path d="M122.826 88.7577H4.90212L0.544678 98.2823L4.90212 107.807H122.826L127.047 98.2823L122.826 88.7577Z" fill="#23CCA2"/>
<path d="M25.4502 82.6347C25.3412 82.6347 25.2641 82.5848 25.2187 82.485L23.1761 77.9677C23.158 77.9223 23.1262 77.8996 23.0808 77.8996H21.5557C21.5012 77.8996 21.474 77.9268 21.474 77.9813V82.4442C21.474 82.4986 21.4558 82.544 21.4195 82.5803C21.3832 82.6166 21.3378 82.6347 21.2834 82.6347H19.377C19.3225 82.6347 19.2726 82.6166 19.2272 82.5803C19.1909 82.544 19.1727 82.4986 19.1727 82.4442V71.3957C19.1727 71.3413 19.1909 71.2959 19.2272 71.2596C19.2726 71.2233 19.3225 71.2052 19.377 71.2052H24.0476C24.7466 71.2052 25.3594 71.3458 25.8859 71.627C26.4124 71.9082 26.821 72.3119 27.1115 72.838C27.4019 73.3641 27.5472 73.9673 27.5472 74.6477C27.5472 75.3915 27.3611 76.0265 26.9889 76.5526C26.6167 77.0787 26.0993 77.4506 25.4366 77.6683C25.3821 77.6955 25.3639 77.7363 25.3821 77.7908L27.6017 82.4034C27.6289 82.4488 27.6425 82.4805 27.6425 82.4986C27.6425 82.5894 27.5835 82.6347 27.4655 82.6347H25.4502ZM21.5557 73.1781C21.5012 73.1781 21.474 73.2054 21.474 73.2598V76.0491C21.474 76.1036 21.5012 76.1308 21.5557 76.1308H23.7072C24.1611 76.1308 24.5333 75.9947 24.8238 75.7226C25.1143 75.4504 25.2595 75.0967 25.2595 74.6613C25.2595 74.2259 25.1143 73.8721 24.8238 73.6C24.5333 73.3188 24.1611 73.1781 23.7072 73.1781H21.5557ZM36.3846 77.5731C36.4482 77.9903 36.4709 78.453 36.4527 78.9609C36.4346 79.0879 36.3619 79.1514 36.2349 79.1514H31.1829C31.1194 79.1514 31.0967 79.1786 31.1149 79.2331C31.1512 79.4508 31.2147 79.6685 31.3055 79.8862C31.5869 80.503 32.1634 80.8114 33.0349 80.8114C33.7339 80.7933 34.2831 80.5075 34.6825 79.9542C34.7279 79.8907 34.7778 79.859 34.8323 79.859C34.8595 79.859 34.8958 79.8816 34.9412 79.927L36.1259 81.0836C36.1804 81.138 36.2076 81.1879 36.2076 81.2332C36.2076 81.2514 36.1849 81.2922 36.1395 81.3557C35.7764 81.8092 35.3134 82.1585 34.7506 82.4034C34.1787 82.6483 33.5568 82.7708 32.8851 82.7708C31.95 82.7708 31.1557 82.5576 30.5021 82.1313C29.8576 81.7049 29.3946 81.1108 29.1132 80.3488C28.8862 79.8045 28.7727 79.0925 28.7727 78.2126C28.7727 77.6139 28.8544 77.0832 29.0178 76.6206C29.2629 75.8496 29.6987 75.2373 30.3251 74.7837C30.9515 74.3211 31.6958 74.0898 32.5583 74.0898C33.6476 74.0898 34.5237 74.4073 35.1863 75.0422C35.84 75.6772 36.2394 76.5208 36.3846 77.5731ZM32.5719 76.09C31.891 76.09 31.4417 76.412 31.2238 77.056C31.1784 77.1921 31.1376 77.3644 31.1012 77.5731C31.1012 77.6275 31.1285 77.6547 31.1829 77.6547H34.0153C34.0788 77.6547 34.1015 77.6275 34.0834 77.5731C34.0289 77.2556 34.0017 77.1014 34.0017 77.1104C33.9018 76.7839 33.7293 76.5344 33.4842 76.3621C33.2391 76.1807 32.935 76.09 32.5719 76.09ZM38.0595 82.6347C38.0051 82.6347 37.9597 82.6166 37.9234 82.5803C37.8871 82.544 37.8689 82.4986 37.8689 82.4442V71.3957C37.8689 71.3413 37.8871 71.2959 37.9234 71.2596C37.9597 71.2233 38.0051 71.2052 38.0595 71.2052H39.9795C40.034 71.2052 40.0794 71.2233 40.1157 71.2596C40.152 71.2959 40.1702 71.3413 40.1702 71.3957V82.4442C40.1702 82.4986 40.152 82.544 40.1157 82.5803C40.0794 82.6166 40.034 82.6347 39.9795 82.6347H38.0595ZM45.2085 74.117C45.9166 74.117 46.5475 74.2395 47.1012 74.4844C47.655 74.7293 48.0862 75.0604 48.3949 75.4777C48.7126 75.904 48.8715 76.3802 48.8715 76.9063V82.4442C48.8715 82.4986 48.8488 82.544 48.8034 82.5803C48.7671 82.6166 48.7217 82.6347 48.6672 82.6347H46.7608C46.7063 82.6347 46.661 82.6166 46.6246 82.5803C46.5793 82.544 46.5566 82.4986 46.5566 82.4442V81.9C46.5566 81.8637 46.5475 81.841 46.5293 81.8319C46.5112 81.8228 46.4885 81.8365 46.4612 81.8727C46.0073 82.4714 45.272 82.7708 44.2553 82.7708C43.411 82.7708 42.7256 82.5621 42.1991 82.1449C41.6726 81.7276 41.4093 81.1198 41.4093 80.3216C41.4093 79.478 41.7044 78.8249 42.2944 78.3622C42.8845 77.8996 43.7242 77.6683 44.8136 77.6683H46.4749C46.5293 77.6683 46.5566 77.6411 46.5566 77.5867V77.2329C46.5566 76.8701 46.4476 76.5889 46.2298 76.3893C46.0119 76.1897 45.6851 76.09 45.2493 76.09C44.9134 76.09 44.6366 76.1489 44.4187 76.2668C44.1917 76.3848 44.0465 76.5526 43.9829 76.7703C43.9466 76.8882 43.874 76.9426 43.7651 76.9336L41.7906 76.675C41.6635 76.6569 41.6045 76.607 41.6136 76.5254C41.659 76.0718 41.8405 75.6591 42.1583 75.2872C42.476 74.9153 42.9027 74.625 43.4383 74.4163C43.9648 74.2168 44.5549 74.117 45.2085 74.117ZM44.8817 81.0563C45.3446 81.0563 45.7395 80.9294 46.0663 80.6754C46.3932 80.4214 46.5566 80.0993 46.5566 79.7093V79.1242C46.5566 79.0698 46.5293 79.0426 46.4749 79.0426H45.3038C44.8136 79.0426 44.4278 79.1333 44.1463 79.3147C43.874 79.5052 43.7378 79.7683 43.7378 80.1039C43.7378 80.3942 43.8422 80.6255 44.051 80.7978C44.2507 80.9702 44.5276 81.0563 44.8817 81.0563ZM55.1217 75.8859C55.1217 75.9403 55.1035 75.9902 55.0672 76.0355C55.0309 76.0718 54.9855 76.09 54.931 76.09H53.3651C53.3106 76.09 53.2834 76.1172 53.2834 76.1716V79.6277C53.2834 79.9905 53.356 80.2581 53.5012 80.4304C53.6465 80.6028 53.8825 80.689 54.2093 80.689H54.754C54.8085 80.689 54.8539 80.7071 54.8902 80.7434C54.9265 80.7888 54.9446 80.8386 54.9446 80.8931V82.4442C54.9446 82.5621 54.8811 82.6302 54.754 82.6483C54.291 82.6755 53.9642 82.6891 53.7736 82.6891C52.8658 82.6891 52.1895 82.5395 51.7446 82.2401C51.2998 81.9408 51.0683 81.3738 51.0502 80.5393V76.1716C51.0502 76.1172 51.0229 76.09 50.9685 76.09H50.0425C49.988 76.09 49.9427 76.0718 49.9063 76.0355C49.87 75.9902 49.8519 75.9403 49.8519 75.8859V74.4436C49.8519 74.3891 49.87 74.3392 49.9063 74.2939C49.9427 74.2576 49.988 74.2395 50.0425 74.2395H50.9685C51.0229 74.2395 51.0502 74.2122 51.0502 74.1578V72.2121C51.0502 72.1577 51.0729 72.1123 51.1183 72.076C51.1546 72.0397 51.2 72.0216 51.2544 72.0216H53.0791C53.1336 72.0216 53.179 72.0397 53.2153 72.076C53.2607 72.1123 53.2834 72.1577 53.2834 72.2121V74.1578C53.2834 74.2122 53.3106 74.2395 53.3651 74.2395H54.931C54.9855 74.2395 55.0309 74.2576 55.0672 74.2939C55.1035 74.3392 55.1217 74.3891 55.1217 74.4436V75.8859ZM57.7497 73.3006C57.3866 73.3006 57.0825 73.1781 56.8374 72.9332C56.5923 72.6883 56.4697 72.3799 56.4697 72.008C56.4697 71.627 56.5878 71.3141 56.8238 71.0691C57.0598 70.8333 57.3685 70.7154 57.7497 70.7154C58.131 70.7154 58.4442 70.8333 58.6893 71.0691C58.9254 71.3141 59.0434 71.627 59.0434 72.008C59.0434 72.3799 58.9208 72.6883 58.6757 72.9332C58.4306 73.1781 58.1219 73.3006 57.7497 73.3006ZM56.7693 82.6347C56.7149 82.6347 56.6695 82.6166 56.6332 82.5803C56.5968 82.544 56.5787 82.4986 56.5787 82.4442V74.4163C56.5787 74.3619 56.5968 74.3166 56.6332 74.2803C56.6695 74.244 56.7149 74.2259 56.7693 74.2259H58.6893C58.7438 74.2259 58.7892 74.244 58.8255 74.2803C58.8618 74.3166 58.88 74.3619 58.88 74.4163V82.4442C58.88 82.4986 58.8618 82.544 58.8255 82.5803C58.7892 82.6166 58.7438 82.6347 58.6893 82.6347H56.7693ZM64.3949 82.7708C63.478 82.7708 62.6927 82.5304 62.0391 82.0496C61.3855 81.5689 60.9361 80.9157 60.691 80.0903C60.5458 79.5732 60.4732 79.0154 60.4732 78.4167C60.4732 77.7817 60.5458 77.2057 60.691 76.6886C60.9452 75.8813 61.3991 75.2509 62.0527 74.7973C62.7063 74.3438 63.4916 74.117 64.4085 74.117C65.2981 74.117 66.0607 74.3392 66.6961 74.7837C67.3225 75.2373 67.7673 75.8677 68.0306 76.675C68.2031 77.2193 68.2893 77.7908 68.2893 78.3895C68.2893 78.9791 68.2167 79.5279 68.0715 80.0359C67.8264 80.8885 67.3815 81.5553 66.737 82.036C66.0834 82.5259 65.3027 82.7708 64.3949 82.7708ZM64.3949 80.7842C64.7489 80.7842 65.053 80.6754 65.3072 80.4577C65.5523 80.24 65.7293 79.9406 65.8383 79.5596C65.929 79.2149 65.9744 78.8339 65.9744 78.4167C65.9744 77.9631 65.929 77.5776 65.8383 77.2601C65.7202 76.8882 65.5387 76.6025 65.2936 76.4029C65.0394 76.1943 64.7307 76.09 64.3676 76.09C64.0045 76.09 63.7004 76.1943 63.4553 76.4029C63.2102 76.6025 63.0331 76.8882 62.9242 77.2601C62.8334 77.5232 62.788 77.9087 62.788 78.4167C62.788 78.9065 62.8244 79.2875 62.897 79.5596C63.0059 79.9406 63.192 80.24 63.4553 80.4577C63.7095 80.6754 64.0227 80.7842 64.3949 80.7842ZM74.1583 74.117C75.0297 74.117 75.7333 74.3801 76.2689 74.9062C76.8045 75.4414 77.0723 76.1671 77.0723 77.0832V82.4442C77.0723 82.4986 77.0541 82.544 77.0178 82.5803C76.9725 82.6166 76.9225 82.6347 76.868 82.6347H74.9617C74.9072 82.6347 74.8618 82.6166 74.8255 82.5803C74.7892 82.544 74.771 82.4986 74.771 82.4442V77.5595C74.771 77.1241 74.6485 76.7703 74.4034 76.4982C74.1583 76.226 73.8314 76.09 73.4229 76.09C73.0235 76.09 72.7012 76.226 72.4561 76.4982C72.211 76.7703 72.0885 77.1241 72.0885 77.5595V82.4442C72.0885 82.4986 72.0703 82.544 72.034 82.5803C71.9886 82.6166 71.9387 82.6347 71.8842 82.6347H69.9778C69.9234 82.6347 69.878 82.6166 69.8417 82.5803C69.8054 82.544 69.7872 82.4986 69.7872 82.4442V74.4436C69.7872 74.3891 69.8054 74.3392 69.8417 74.2939C69.878 74.2576 69.9234 74.2395 69.9778 74.2395H71.8842C71.9387 74.2395 71.9886 74.2576 72.034 74.2939C72.0703 74.3392 72.0885 74.3891 72.0885 74.4436V75.015C72.0885 75.0422 72.0975 75.0604 72.1157 75.0695C72.1429 75.0876 72.1611 75.0831 72.1702 75.0559C72.615 74.43 73.2777 74.117 74.1583 74.117ZM82.0698 82.7436C81.3435 82.7436 80.708 82.6438 80.1634 82.4442C79.6187 82.2356 79.1966 81.9453 78.897 81.5734C78.5974 81.2015 78.4476 80.7842 78.4476 80.3216V80.1583C78.4476 80.1039 78.4658 80.054 78.5021 80.0086C78.5384 79.9724 78.5838 79.9542 78.6383 79.9542H80.4493C80.5038 79.9542 80.5492 79.9724 80.5855 80.0086C80.6309 80.054 80.6536 80.1039 80.6536 80.1583V80.1719C80.6536 80.4078 80.7852 80.6119 81.0485 80.7842C81.3117 80.9475 81.6476 81.0291 82.0561 81.0291C82.4283 81.0291 82.7279 80.9566 82.9548 80.8114C83.1818 80.6663 83.2953 80.4849 83.2953 80.2672C83.2953 80.0676 83.1954 79.9225 82.9957 79.8318C82.8051 79.732 82.4873 79.6277 82.0425 79.5188C81.5251 79.3827 81.1211 79.2557 80.8306 79.1378C80.1316 78.902 79.5733 78.6072 79.1557 78.2534C78.7472 77.9087 78.5429 77.4098 78.5429 76.7567C78.5429 75.9494 78.8561 75.3098 79.4825 74.8382C80.1089 74.3665 80.9395 74.1306 81.9744 74.1306C82.6734 74.1306 83.2817 74.2395 83.7991 74.4572C84.3256 74.6839 84.7341 74.9969 85.0246 75.396C85.3061 75.8042 85.4468 76.2623 85.4468 76.7703C85.4468 76.8247 85.4286 76.8701 85.3923 76.9063C85.356 76.9517 85.3106 76.9744 85.2561 76.9744H83.5132C83.4587 76.9744 83.4088 76.9517 83.3634 76.9063C83.327 76.8701 83.3089 76.8247 83.3089 76.7703C83.3089 76.5344 83.1863 76.3349 82.9412 76.1716C82.6961 76.0083 82.3739 75.9267 81.9744 75.9267C81.6113 75.9267 81.3163 75.9902 81.0893 76.1172C80.8624 76.2532 80.7489 76.4347 80.7489 76.6614C80.7489 76.8791 80.8578 77.0424 81.0757 77.1513C81.3027 77.2601 81.6794 77.3735 82.2059 77.4914C82.3239 77.5277 82.4601 77.564 82.6144 77.6003C82.7597 77.6366 82.9231 77.6819 83.1046 77.7363C83.8763 77.9631 84.4845 78.2579 84.9293 78.6208C85.3741 78.9745 85.5966 79.4961 85.5966 80.1855C85.5966 80.9928 85.2788 81.6233 84.6434 82.0768C84.0079 82.5213 83.15 82.7436 82.0698 82.7436ZM91.3021 74.117C92.1736 74.117 92.8771 74.3801 93.4127 74.9062C93.9483 75.4414 94.2161 76.1671 94.2161 77.0832V82.4442C94.2161 82.4986 94.1934 82.544 94.148 82.5803C94.1117 82.6166 94.0663 82.6347 94.0119 82.6347H92.1055C92.051 82.6347 92.0056 82.6166 91.9693 82.5803C91.9239 82.544 91.9012 82.4986 91.9012 82.4442V77.5595C91.9012 77.1241 91.7787 76.7703 91.5336 76.4982C91.2885 76.226 90.9662 76.09 90.5668 76.09C90.1673 76.09 89.8451 76.226 89.6 76.4982C89.3549 76.7703 89.2323 77.1241 89.2323 77.5595V82.4442C89.2323 82.4986 89.2096 82.544 89.1642 82.5803C89.1279 82.6166 89.0825 82.6347 89.028 82.6347H87.1217C87.0672 82.6347 87.0218 82.6166 86.9855 82.5803C86.9401 82.544 86.9174 82.4986 86.9174 82.4442V71.3957C86.9174 71.3413 86.9401 71.2959 86.9855 71.2596C87.0218 71.2233 87.0672 71.2052 87.1217 71.2052H89.028C89.0825 71.2052 89.1279 71.2233 89.1642 71.2596C89.2096 71.2959 89.2323 71.3413 89.2323 71.3957V75.015C89.2323 75.0422 89.2414 75.0604 89.2595 75.0695C89.2777 75.0876 89.2958 75.0831 89.314 75.0559C89.7588 74.43 90.4215 74.117 91.3021 74.117ZM97.1029 73.3006C96.7307 73.3006 96.4221 73.1781 96.177 72.9332C95.9319 72.6883 95.8093 72.3799 95.8093 72.008C95.8093 71.627 95.9319 71.3141 96.177 71.0691C96.413 70.8333 96.7217 70.7154 97.1029 70.7154C97.4842 70.7154 97.7929 70.8333 98.0289 71.0691C98.274 71.3141 98.3966 71.627 98.3966 72.008C98.3966 72.3799 98.274 72.6883 98.0289 72.9332C97.7838 73.1781 97.4751 73.3006 97.1029 73.3006ZM96.1225 82.6347C96.068 82.6347 96.0227 82.6166 95.9863 82.5803C95.95 82.544 95.9319 82.4986 95.9319 82.4442V74.4163C95.9319 74.3619 95.95 74.3166 95.9863 74.2803C96.0227 74.244 96.068 74.2259 96.1225 74.2259H98.0289C98.0834 74.2259 98.1333 74.244 98.1787 74.2803C98.215 74.3166 98.2331 74.3619 98.2331 74.4163V82.4442C98.2331 82.4986 98.215 82.544 98.1787 82.5803C98.1333 82.6166 98.0834 82.6347 98.0289 82.6347H96.1225ZM107.534 76.4982C107.724 77.0515 107.82 77.7046 107.82 78.4575C107.82 79.2104 107.715 79.8907 107.506 80.4985C107.261 81.1969 106.866 81.7503 106.322 82.1585C105.786 82.5667 105.119 82.7708 104.32 82.7708C103.539 82.7708 102.931 82.4986 102.495 81.9544C102.477 81.9181 102.454 81.9045 102.427 81.9136C102.409 81.9226 102.4 81.9453 102.4 81.9816V85.4785C102.4 85.5329 102.382 85.5783 102.345 85.6145C102.3 85.6508 102.25 85.669 102.196 85.669H100.289C100.235 85.669 100.189 85.6508 100.153 85.6145C100.117 85.5783 100.099 85.5329 100.099 85.4785V74.4436C100.099 74.3891 100.117 74.3392 100.153 74.2939C100.189 74.2576 100.235 74.2395 100.289 74.2395H102.196C102.25 74.2395 102.3 74.2576 102.345 74.2939C102.382 74.3392 102.4 74.3891 102.4 74.4436V74.9742C102.4 75.0105 102.409 75.0286 102.427 75.0286C102.454 75.0377 102.477 75.0332 102.495 75.015C102.949 74.4163 103.58 74.117 104.388 74.117C105.142 74.117 105.795 74.3256 106.349 74.7429C106.894 75.1602 107.288 75.7453 107.534 76.4982ZM105.028 80.1583C105.3 79.732 105.437 79.1514 105.437 78.4167C105.437 77.7363 105.323 77.1921 105.096 76.7839C104.842 76.3213 104.438 76.09 103.884 76.09C103.385 76.09 103.008 76.3213 102.754 76.7839C102.527 77.183 102.414 77.7363 102.414 78.4439C102.414 79.1696 102.532 79.732 102.768 80.1311C103.022 80.5665 103.394 80.7842 103.884 80.7842C104.374 80.7842 104.756 80.5756 105.028 80.1583ZM54.3863 60.3472C54.3228 60.3834 54.3228 60.4152 54.3863 60.4424C55.4212 60.9776 55.9387 61.8666 55.9387 63.1093C55.9387 64.1615 55.5801 64.9598 54.8629 65.5041C54.1458 66.0392 53.2017 66.3068 52.0306 66.3068H47.8093C47.7549 66.3068 47.7049 66.2887 47.6595 66.2524C47.6232 66.2161 47.6051 66.1708 47.6051 66.1163V55.0678C47.6051 55.0134 47.6232 54.968 47.6595 54.9318C47.7049 54.8955 47.7549 54.8773 47.8093 54.8773H51.908C54.4862 54.8773 55.7753 55.9205 55.7753 58.0068C55.7753 59.0954 55.3123 59.8755 54.3863 60.3472ZM49.988 56.8503C49.9336 56.8503 49.9063 56.8775 49.9063 56.9319V59.4763C49.9063 59.5308 49.9336 59.558 49.988 59.558H51.908C52.4164 59.558 52.8113 59.4401 53.0927 59.2042C53.3832 58.9684 53.5285 58.6418 53.5285 58.2245C53.5285 57.7982 53.3832 57.4626 53.0927 57.2177C52.8113 56.9727 52.4164 56.8503 51.908 56.8503H49.988ZM52.0306 64.3203C52.539 64.3203 52.9339 64.1888 53.2153 63.9257C53.4967 63.6717 53.6374 63.3225 53.6374 62.878C53.6374 62.4335 53.4967 62.0843 53.2153 61.8303C52.9339 61.5672 52.5344 61.4357 52.017 61.4357H49.988C49.9336 61.4357 49.9063 61.4629 49.9063 61.5173V64.2386C49.9063 64.2931 49.9336 64.3203 49.988 64.3203H52.0306ZM65.0212 61.2452C65.0939 61.6625 65.1166 62.1251 65.0893 62.6331C65.0802 62.7601 65.0122 62.8236 64.8851 62.8236H59.8332C59.7696 62.8236 59.7469 62.8508 59.7651 62.9052C59.8014 63.1229 59.8604 63.3406 59.9421 63.5583C60.2235 64.1751 60.8 64.4836 61.6715 64.4836C62.3705 64.4654 62.9242 64.1797 63.3327 63.6263C63.369 63.5628 63.4144 63.5311 63.4689 63.5311C63.5052 63.5311 63.5461 63.5538 63.5915 63.5991L64.7625 64.7557C64.817 64.8101 64.8442 64.86 64.8442 64.9054C64.8442 64.9235 64.8215 64.9643 64.7761 65.0278C64.4221 65.4814 63.9591 65.8306 63.3872 66.0755C62.8244 66.3204 62.2071 66.4429 61.5353 66.4429C60.5912 66.4429 59.7968 66.2297 59.1523 65.8034C58.5078 65.3771 58.0402 64.7829 57.7497 64.0209C57.5228 63.4767 57.4093 62.7646 57.4093 61.8847C57.4093 61.286 57.491 60.7554 57.6544 60.2927C57.9086 59.5217 58.3489 58.9094 58.9753 58.4559C59.6017 57.9932 60.3461 57.7619 61.2085 57.7619C62.2978 57.7619 63.1693 58.0794 63.8229 58.7144C64.4856 59.3493 64.8851 60.193 65.0212 61.2452ZM61.2221 59.7621C60.5322 59.7621 60.0783 60.0841 59.8604 60.7282C59.815 60.8642 59.7787 61.0366 59.7515 61.2452C59.7515 61.2996 59.7787 61.3268 59.8332 61.3268H62.6519C62.7245 61.3268 62.7472 61.2996 62.72 61.2452C62.6655 60.9277 62.6383 60.7735 62.6383 60.7826C62.5384 60.456 62.3659 60.2066 62.1208 60.0342C61.8757 59.8528 61.5761 59.7621 61.2221 59.7621ZM69.7463 66.4157C69.0201 66.4157 68.3846 66.3159 67.84 66.1163C67.2953 65.9077 66.8731 65.6174 66.5736 65.2455C66.274 64.8736 66.1242 64.4563 66.1242 63.9937V63.8304C66.1242 63.776 66.1424 63.7261 66.1787 63.6808C66.215 63.6445 66.2604 63.6263 66.3149 63.6263H68.1259C68.1804 63.6263 68.2303 63.6445 68.2757 63.6808C68.312 63.7261 68.3302 63.776 68.3302 63.8304V63.844C68.3302 64.0799 68.4618 64.284 68.7251 64.4563C68.9974 64.6196 69.3333 64.7013 69.7327 64.7013C70.1049 64.7013 70.4045 64.6287 70.6315 64.4836C70.8584 64.3384 70.9719 64.157 70.9719 63.9393C70.9719 63.7397 70.8766 63.5946 70.6859 63.5039C70.4862 63.4041 70.1639 63.2998 69.7191 63.1909C69.2017 63.0549 68.7977 62.9279 68.5072 62.81C67.8082 62.5741 67.2544 62.2793 66.8459 61.9255C66.4283 61.5808 66.2195 61.0819 66.2195 60.4288C66.2195 59.6215 66.5327 58.982 67.1591 58.5103C67.7855 58.0386 68.6161 57.8027 69.651 57.8027C70.35 57.8027 70.9583 57.9116 71.4757 58.1293C72.0022 58.3561 72.4107 58.669 72.7012 59.0681C72.9917 59.4763 73.137 59.9344 73.137 60.4424C73.137 60.4968 73.1143 60.5422 73.0689 60.5785C73.0326 60.6238 72.9872 60.6465 72.9327 60.6465H71.1897C71.1353 60.6465 71.0899 60.6238 71.0536 60.5785C71.0082 60.5422 70.9855 60.4968 70.9855 60.4424C70.9855 60.2066 70.8629 60.007 70.6178 59.8437C70.3727 59.6804 70.0505 59.5988 69.651 59.5988C69.2879 59.5988 68.9929 59.6623 68.7659 59.7893C68.539 59.9254 68.4255 60.1068 68.4255 60.3336C68.4255 60.5513 68.539 60.7145 68.7659 60.8234C68.9838 60.9322 69.356 61.0456 69.8825 61.1636C70.0005 61.1998 70.1367 61.2361 70.291 61.2724C70.4454 61.3087 70.6088 61.3541 70.7812 61.4085C71.5529 61.6353 72.1611 61.9301 72.6059 62.2929C73.0507 62.6467 73.2732 63.1683 73.2732 63.8577C73.2732 64.665 72.9554 65.2954 72.32 65.749C71.6845 66.1934 70.8266 66.4157 69.7463 66.4157ZM79.4008 59.558C79.4008 59.6124 79.3827 59.6623 79.3463 59.7077C79.31 59.7439 79.2646 59.7621 79.2102 59.7621H77.6442C77.5898 59.7621 77.5625 59.7893 77.5625 59.8437V63.2998C77.5625 63.6626 77.6351 63.9302 77.7804 64.1026C77.9256 64.2749 78.1617 64.3611 78.4885 64.3611H79.0332C79.0876 64.3611 79.133 64.3792 79.1693 64.4155C79.2056 64.4609 79.2238 64.5108 79.2238 64.5652V66.1163C79.2238 66.2343 79.1602 66.3023 79.0332 66.3204C78.5702 66.3477 78.2434 66.3613 78.0527 66.3613C77.1449 66.3613 76.4686 66.2116 76.0238 65.9122C75.579 65.6129 75.352 65.046 75.3429 64.2114V59.8437C75.3429 59.7893 75.3157 59.7621 75.2612 59.7621H74.3217C74.2672 59.7621 74.2218 59.7439 74.1855 59.7077C74.1492 59.6623 74.131 59.6124 74.131 59.558V58.1157C74.131 58.0613 74.1492 58.0114 74.1855 57.966C74.2218 57.9297 74.2672 57.9116 74.3217 57.9116H75.2612C75.3157 57.9116 75.3429 57.8844 75.3429 57.83V55.8842C75.3429 55.8298 75.3611 55.7844 75.3974 55.7482C75.4337 55.7119 75.4791 55.6937 75.5336 55.6937H77.3583C77.4127 55.6937 77.4627 55.7119 77.508 55.7482C77.5444 55.7844 77.5625 55.8298 77.5625 55.8842V57.83C77.5625 57.8844 77.5898 57.9116 77.6442 57.9116H79.2102C79.2646 57.9116 79.31 57.9297 79.3463 57.966C79.3827 58.0114 79.4008 58.0613 79.4008 58.1157V59.558Z" fill="#252530"/>
<path d="M39.1354 95.2616C39.1354 95.3069 39.1218 95.3432 39.0945 95.3704C39.0582 95.4067 39.0174 95.4249 38.972 95.4249H34.3286C34.2832 95.4249 34.2605 95.4475 34.2605 95.4929V98.0373C34.2605 98.0827 34.2832 98.1054 34.3286 98.1054H37.4469C37.4923 98.1054 37.5331 98.119 37.5694 98.1462C37.5967 98.1825 37.6103 98.2233 37.6103 98.2686V99.3027C37.6103 99.3481 37.5967 99.3889 37.5694 99.4252C37.5331 99.4524 37.4923 99.466 37.4469 99.466H34.3286C34.2832 99.466 34.2605 99.4887 34.2605 99.534V102.16C34.2605 102.205 34.2832 102.228 34.3286 102.228H38.972C39.0174 102.228 39.0582 102.246 39.0945 102.283C39.1218 102.31 39.1354 102.346 39.1354 102.391V103.426C39.1354 103.471 39.1218 103.507 39.0945 103.534C39.0582 103.571 39.0174 103.589 38.972 103.589H32.8443C32.7989 103.589 32.7626 103.571 32.7354 103.534C32.6991 103.507 32.6809 103.471 32.6809 103.426V94.2275C32.6809 94.1821 32.6991 94.1459 32.7354 94.1186C32.7626 94.0824 32.7989 94.0642 32.8443 94.0642H38.972C39.0174 94.0642 39.0582 94.0824 39.0945 94.1186C39.1218 94.1459 39.1354 94.1821 39.1354 94.2275V95.2616ZM43.9286 96.527C44.6639 96.527 45.254 96.7447 45.6988 97.1801C46.1345 97.6155 46.3524 98.2097 46.3524 98.9626V103.426C46.3524 103.471 46.3342 103.507 46.2979 103.534C46.2707 103.571 46.2344 103.589 46.189 103.589H44.9362C44.8908 103.589 44.85 103.571 44.8137 103.534C44.7864 103.507 44.7728 103.471 44.7728 103.426V99.2891C44.7728 98.8719 44.6548 98.5317 44.4188 98.2686C44.1828 98.0146 43.8696 97.8877 43.4792 97.8877C43.0889 97.8877 42.7711 98.0146 42.526 98.2686C42.29 98.5226 42.172 98.8583 42.172 99.2755V103.426C42.172 103.471 42.1584 103.507 42.1311 103.534C42.0948 103.571 42.054 103.589 42.0086 103.589H40.7558C40.7104 103.589 40.6741 103.571 40.6469 103.534C40.6106 103.507 40.5924 103.471 40.5924 103.426V96.7991C40.5924 96.7538 40.6106 96.713 40.6469 96.6767C40.6741 96.6495 40.7104 96.6359 40.7558 96.6359H42.0086C42.054 96.6359 42.0948 96.6495 42.1311 96.6767C42.1584 96.713 42.172 96.7538 42.172 96.7991V97.2345C42.172 97.2618 42.181 97.2799 42.1992 97.289C42.2174 97.298 42.231 97.289 42.2401 97.2618C42.6123 96.7719 43.1751 96.527 43.9286 96.527ZM51.6903 97.7516C51.6903 97.7969 51.6721 97.8332 51.6358 97.8604C51.6086 97.8967 51.5723 97.9149 51.5269 97.9149H50.1379C50.0925 97.9149 50.0698 97.9375 50.0698 97.9829V101.262C50.0698 101.607 50.1425 101.856 50.2877 102.01C50.442 102.165 50.6826 102.242 51.0094 102.242H51.4179C51.4633 102.242 51.4996 102.255 51.5269 102.283C51.5632 102.319 51.5813 102.36 51.5813 102.405V103.426C51.5813 103.525 51.5269 103.584 51.4179 103.602L50.7098 103.616C49.9927 103.616 49.4571 103.494 49.103 103.249C48.749 103.004 48.5674 102.541 48.5584 101.861V97.9829C48.5584 97.9375 48.5357 97.9149 48.4903 97.9149H47.7141C47.6687 97.9149 47.6279 97.8967 47.5915 97.8604C47.5643 97.8332 47.5507 97.7969 47.5507 97.7516V96.7991C47.5507 96.7538 47.5643 96.713 47.5915 96.6767C47.6279 96.6495 47.6687 96.6359 47.7141 96.6359H48.4903C48.5357 96.6359 48.5584 96.6132 48.5584 96.5678V94.9759C48.5584 94.9305 48.572 94.8897 48.5992 94.8534C48.6355 94.8262 48.6764 94.8126 48.7218 94.8126H49.9064C49.9518 94.8126 49.9881 94.8262 50.0154 94.8534C50.0517 94.8897 50.0698 94.9305 50.0698 94.9759V96.5678C50.0698 96.6132 50.0925 96.6359 50.1379 96.6359H51.5269C51.5723 96.6359 51.6086 96.6495 51.6358 96.6767C51.6721 96.713 51.6903 96.7538 51.6903 96.7991V97.7516ZM58.8256 99.3299C58.8619 99.5567 58.8801 99.8107 58.8801 100.092L58.8664 100.514C58.8664 100.623 58.812 100.677 58.703 100.677H54.4409C54.3955 100.677 54.3728 100.7 54.3728 100.745C54.4001 101.044 54.4409 101.248 54.4954 101.357C54.7132 102.01 55.2443 102.342 56.0886 102.351C56.7059 102.351 57.1961 102.097 57.5592 101.589C57.5955 101.534 57.6409 101.507 57.6954 101.507C57.7317 101.507 57.7635 101.521 57.7907 101.548L58.635 102.242C58.7167 102.305 58.7303 102.378 58.6758 102.459C58.3944 102.859 58.0222 103.167 57.5592 103.385C57.0871 103.602 56.5652 103.711 55.9932 103.711C55.2852 103.711 54.6815 103.553 54.1822 103.235C53.692 102.918 53.3334 102.473 53.1064 101.902C52.8976 101.412 52.7932 100.731 52.7932 99.8606C52.7932 99.3345 52.8477 98.9081 52.9567 98.5816C53.1382 97.9466 53.4832 97.4432 53.9915 97.0713C54.4908 96.7084 55.0945 96.527 55.8026 96.527C57.591 96.527 58.5986 97.4613 58.8256 99.3299ZM55.8026 97.8877C55.4667 97.8877 55.1853 97.9738 54.9584 98.1462C54.7405 98.3095 54.5862 98.5408 54.4954 98.8401C54.4409 98.9943 54.4046 99.1939 54.3864 99.4388C54.3683 99.4842 54.3864 99.5068 54.4409 99.5068H57.2052C57.2506 99.5068 57.2733 99.4842 57.2733 99.4388C57.2551 99.212 57.2279 99.0397 57.1915 98.9218C57.1098 98.5952 56.951 98.3412 56.715 98.1598C56.4698 97.9784 56.1657 97.8877 55.8026 97.8877ZM63.5643 96.5542C63.8548 96.5542 64.109 96.6132 64.3269 96.7311C64.3995 96.7674 64.4267 96.8354 64.4086 96.9352L64.1771 98.1598C64.168 98.2686 64.1045 98.3004 63.9864 98.255C63.8503 98.2097 63.6914 98.187 63.5098 98.187C63.3918 98.187 63.301 98.1915 63.2375 98.2006C62.8562 98.2188 62.5385 98.3503 62.2843 98.5952C62.0301 98.8492 61.903 99.1757 61.903 99.5749V103.426C61.903 103.471 61.8894 103.507 61.8622 103.534C61.8259 103.571 61.785 103.589 61.7396 103.589H60.4869C60.4415 103.589 60.4052 103.571 60.3779 103.534C60.3416 103.507 60.3235 103.471 60.3235 103.426V96.7991C60.3235 96.7538 60.3416 96.713 60.3779 96.6767C60.4052 96.6495 60.4415 96.6359 60.4869 96.6359H61.7396C61.785 96.6359 61.8259 96.6495 61.8622 96.6767C61.8894 96.713 61.903 96.7538 61.903 96.7991V97.4114C61.903 97.4477 61.9076 97.4659 61.9167 97.4659C61.9348 97.4749 61.953 97.4658 61.9711 97.4386C62.3524 96.849 62.8835 96.5542 63.5643 96.5542ZM71.3396 98.4319C71.503 98.8945 71.5847 99.4615 71.5847 100.133C71.5847 100.777 71.5076 101.33 71.3532 101.793C71.1535 102.391 70.8358 102.859 70.4001 103.194C69.9552 103.53 69.3969 103.698 68.7252 103.698C68.0806 103.698 67.5632 103.466 67.1728 103.004C67.1547 102.986 67.1365 102.981 67.1184 102.99C67.1002 102.999 67.0911 103.017 67.0911 103.045V105.997C67.0911 106.043 67.0775 106.079 67.0503 106.106C67.014 106.142 66.9731 106.16 66.9277 106.16H65.6749C65.6296 106.16 65.5933 106.142 65.566 106.106C65.5297 106.079 65.5115 106.043 65.5115 105.997V96.7991C65.5115 96.7538 65.5297 96.713 65.566 96.6767C65.5933 96.6495 65.6296 96.6359 65.6749 96.6359H66.9277C66.9731 96.6359 67.014 96.6495 67.0503 96.6767C67.0775 96.713 67.0911 96.7538 67.0911 96.7991V97.2073C67.0911 97.2345 67.1002 97.2527 67.1184 97.2618C67.1365 97.2708 67.1547 97.2618 67.1728 97.2345C67.5723 96.7629 68.0942 96.527 68.7388 96.527C69.3833 96.527 69.928 96.6948 70.3728 97.0304C70.8176 97.3661 71.1399 97.8332 71.3396 98.4319ZM69.5694 101.766C69.8418 101.348 69.9779 100.795 69.9779 100.106C69.9779 99.4433 69.869 98.9218 69.6511 98.5408C69.3969 98.0963 69.0111 97.874 68.4937 97.874C68.0216 97.874 67.6676 98.0918 67.4315 98.5272C67.2228 98.8809 67.1184 99.407 67.1184 100.106C67.1184 100.822 67.2318 101.366 67.4588 101.738C67.6948 102.137 68.0352 102.337 68.4801 102.337C68.9612 102.337 69.3243 102.147 69.5694 101.766ZM76.3507 96.5542C76.6412 96.5542 76.8954 96.6132 77.1132 96.7311C77.1859 96.7674 77.2131 96.8354 77.1949 96.9352L76.9635 98.1598C76.9544 98.2686 76.8908 98.3004 76.7728 98.255C76.6367 98.2097 76.4778 98.187 76.2962 98.187C76.1782 98.187 76.0874 98.1915 76.0239 98.2006C75.6426 98.2188 75.3249 98.3503 75.0707 98.5952C74.8165 98.8492 74.6894 99.1757 74.6894 99.5749V103.426C74.6894 103.471 74.6758 103.507 74.6486 103.534C74.6123 103.571 74.5714 103.589 74.526 103.589H73.2733C73.2279 103.589 73.1915 103.571 73.1643 103.534C73.128 103.507 73.1098 103.471 73.1098 103.426V96.7991C73.1098 96.7538 73.128 96.713 73.1643 96.6767C73.1915 96.6495 73.2279 96.6359 73.2733 96.6359H74.526C74.5714 96.6359 74.6123 96.6495 74.6486 96.6767C74.6758 96.713 74.6894 96.7538 74.6894 96.7991V97.4114C74.6894 97.4477 74.694 97.4659 74.703 97.4659C74.7212 97.4749 74.7393 97.4658 74.7575 97.4386C75.1388 96.849 75.6698 96.5542 76.3507 96.5542ZM79.1286 95.6834C78.8471 95.6834 78.6157 95.5927 78.4341 95.4113C78.2525 95.2298 78.1618 94.9985 78.1618 94.7173C78.1618 94.4361 78.2525 94.2048 78.4341 94.0234C78.6157 93.842 78.8471 93.7513 79.1286 93.7513C79.41 93.7513 79.6415 93.842 79.823 94.0234C80.0046 94.2048 80.0954 94.4361 80.0954 94.7173C80.0954 94.9985 80.0046 95.2298 79.823 95.4113C79.6415 95.5927 79.41 95.6834 79.1286 95.6834ZM78.4749 103.589C78.4296 103.589 78.3932 103.571 78.366 103.534C78.3297 103.507 78.3115 103.471 78.3115 103.426V96.7855C78.3115 96.7402 78.3297 96.7039 78.366 96.6767C78.3932 96.6404 78.4296 96.6222 78.4749 96.6222H79.7277C79.7731 96.6222 79.814 96.6404 79.8503 96.6767C79.8775 96.7039 79.8911 96.7402 79.8911 96.7855V103.426C79.8911 103.471 79.8775 103.507 79.8503 103.534C79.814 103.571 79.7731 103.589 79.7277 103.589H78.4749ZM84.2894 103.67C83.7175 103.67 83.2137 103.584 82.7779 103.412C82.3513 103.249 82.0199 103.017 81.7839 102.718C81.5479 102.428 81.4298 102.101 81.4298 101.738V101.616C81.4298 101.57 81.4435 101.53 81.4707 101.493C81.507 101.466 81.5479 101.453 81.5932 101.453H82.7915C82.8369 101.453 82.8778 101.466 82.9141 101.493C82.9413 101.53 82.9549 101.57 82.9549 101.616V101.643C82.9549 101.87 83.0775 102.069 83.3226 102.242C83.5768 102.405 83.8945 102.487 84.2758 102.487C84.6389 102.487 84.934 102.414 85.1609 102.269C85.3879 102.115 85.5013 101.924 85.5013 101.697C85.5013 101.489 85.406 101.33 85.2154 101.221C85.0338 101.121 84.7342 101.013 84.3167 100.895L83.7992 100.731C83.3362 100.595 82.9459 100.45 82.6281 100.296C82.3104 100.142 82.0426 99.9286 81.8247 99.6565C81.6069 99.3935 81.4979 99.0533 81.4979 98.636C81.4979 98.001 81.7476 97.4976 82.2469 97.1257C82.7462 96.7447 83.4043 96.5542 84.2213 96.5542C84.7751 96.5542 85.2608 96.6404 85.6784 96.8127C86.0959 96.9942 86.4182 97.2391 86.6452 97.5475C86.8721 97.865 86.9856 98.2233 86.9856 98.6224C86.9856 98.6678 86.972 98.7086 86.9447 98.7449C86.9084 98.7721 86.8676 98.7857 86.8222 98.7857H85.6647C85.6193 98.7857 85.5785 98.7721 85.5422 98.7449C85.5149 98.7086 85.5013 98.6678 85.5013 98.6224C85.5013 98.3866 85.3879 98.1915 85.1609 98.0373C84.9249 97.874 84.6071 97.7924 84.2077 97.7924C83.8537 97.7924 83.5677 97.8559 83.3498 97.9829C83.1229 98.119 83.0094 98.3049 83.0094 98.5408C83.0094 98.7585 83.1138 98.9218 83.3226 99.0306C83.5405 99.1485 83.8991 99.2755 84.3984 99.4116L84.6979 99.4932C85.1791 99.6384 85.583 99.7835 85.9098 99.9286C86.2367 100.083 86.5135 100.291 86.7405 100.555C86.9674 100.827 87.0809 101.176 87.0809 101.602C87.0809 102.246 86.8267 102.75 86.3184 103.113C85.81 103.484 85.1337 103.67 84.2894 103.67ZM94.2843 99.3299C94.3206 99.5567 94.3388 99.8107 94.3388 100.092L94.3252 100.514C94.3252 100.623 94.2707 100.677 94.1618 100.677H89.8996C89.8542 100.677 89.8315 100.7 89.8315 100.745C89.8588 101.044 89.8996 101.248 89.9541 101.357C90.172 102.01 90.703 102.342 91.5473 102.351C92.1646 102.351 92.6548 102.097 93.0179 101.589C93.0542 101.534 93.0996 101.507 93.1541 101.507C93.1904 101.507 93.2222 101.521 93.2494 101.548L94.0937 102.242C94.1754 102.305 94.189 102.378 94.1345 102.459C93.8531 102.859 93.4764 103.167 93.0043 103.385C92.5413 103.602 92.0239 103.711 91.452 103.711C90.7439 103.711 90.1402 103.553 89.6409 103.235C89.1507 102.918 88.7921 102.473 88.5652 101.902C88.3564 101.412 88.252 100.731 88.252 99.8606C88.252 99.3345 88.3064 98.9081 88.4154 98.5816C88.5969 97.9466 88.9374 97.4432 89.4367 97.0713C89.945 96.7084 90.5532 96.527 91.2613 96.527C93.0497 96.527 94.0574 97.4613 94.2843 99.3299ZM91.2613 97.8877C90.9254 97.8877 90.644 97.9738 90.4171 98.1462C90.1992 98.3095 90.0449 98.5408 89.9541 98.8401C89.8996 98.9943 89.8633 99.1939 89.8452 99.4388C89.827 99.4842 89.8452 99.5068 89.8996 99.5068H92.6639C92.7093 99.5068 92.732 99.4842 92.732 99.4388C92.7138 99.212 92.6866 99.0397 92.6503 98.9218C92.5686 98.5952 92.4052 98.3412 92.1601 98.1598C91.924 97.9784 91.6244 97.8877 91.2613 97.8877Z" fill="#242530"/>
<path d="M45.1404 122.883C44.4141 122.883 43.7787 122.765 43.234 122.529C42.6893 122.302 42.2717 121.971 41.9812 121.536C41.6816 121.11 41.5319 120.611 41.5319 120.039V119.74C41.5319 119.694 41.55 119.658 41.5863 119.631C41.6136 119.595 41.6499 119.577 41.6953 119.577H43.2476C43.293 119.577 43.3338 119.595 43.3702 119.631C43.3974 119.658 43.411 119.694 43.411 119.74V119.944C43.411 120.307 43.579 120.611 43.9148 120.856C44.2507 121.11 44.7046 121.237 45.2765 121.237C45.7577 121.237 46.1163 121.137 46.3523 120.937C46.5883 120.729 46.7063 120.475 46.7063 120.175C46.7063 119.957 46.6337 119.776 46.4885 119.631C46.3432 119.477 46.1435 119.345 45.8893 119.236C45.6442 119.118 45.2493 118.96 44.7046 118.76C44.0964 118.551 43.579 118.338 43.1523 118.121C42.7347 117.903 42.3852 117.604 42.1038 117.223C41.8133 116.851 41.668 116.388 41.668 115.835C41.668 115.29 41.8087 114.814 42.0902 114.406C42.3716 113.998 42.7619 113.685 43.2612 113.467C43.7605 113.249 44.337 113.141 44.9906 113.141C45.6805 113.141 46.2933 113.263 46.8289 113.508C47.3736 113.753 47.8002 114.098 48.1089 114.542C48.4085 114.977 48.5582 115.485 48.5582 116.066V116.27C48.5582 116.315 48.5446 116.352 48.5174 116.379C48.4811 116.415 48.4402 116.433 48.3948 116.433H46.8289C46.7835 116.433 46.7472 116.415 46.7199 116.379C46.6836 116.352 46.6655 116.315 46.6655 116.27V116.161C46.6655 115.78 46.5112 115.454 46.2025 115.182C45.8848 114.919 45.4536 114.787 44.9089 114.787C44.4822 114.787 44.1463 114.878 43.9012 115.059C43.6652 115.241 43.5472 115.49 43.5472 115.807C43.5472 116.034 43.6198 116.225 43.7651 116.379C43.9012 116.533 44.11 116.669 44.3914 116.787C44.6638 116.914 45.0904 117.082 45.6714 117.291C46.316 117.526 46.8198 117.735 47.1829 117.917C47.5551 118.098 47.891 118.366 48.1906 118.719C48.4811 119.082 48.6263 119.549 48.6263 120.121C48.6263 120.973 48.3131 121.645 47.6868 122.135C47.0604 122.633 46.2116 122.883 45.1404 122.883ZM53.9097 113.236C54.5089 113.236 55.0354 113.358 55.4893 113.603C55.9432 113.848 56.2972 114.193 56.5514 114.637C56.7965 115.091 56.9191 115.608 56.9191 116.188C56.9191 116.76 56.792 117.263 56.5378 117.699C56.2746 118.134 55.9069 118.474 55.4348 118.719C54.9719 118.955 54.4363 119.073 53.828 119.073H51.8944C51.849 119.073 51.8263 119.096 51.8263 119.141V122.611C51.8263 122.656 51.8082 122.692 51.7719 122.72C51.7446 122.756 51.7083 122.774 51.6629 122.774H50.0697C50.0243 122.774 49.9835 122.756 49.9472 122.72C49.9199 122.692 49.9063 122.656 49.9063 122.611V113.399C49.9063 113.354 49.9199 113.313 49.9472 113.277C49.9835 113.249 50.0243 113.236 50.0697 113.236H53.9097ZM53.6238 117.536C54.0414 117.536 54.3772 117.413 54.6314 117.168C54.8856 116.932 55.0127 116.619 55.0127 116.229C55.0127 115.83 54.8856 115.508 54.6314 115.263C54.3772 115.018 54.0414 114.896 53.6238 114.896H51.8944C51.849 114.896 51.8263 114.919 51.8263 114.964V117.467C51.8263 117.513 51.849 117.536 51.8944 117.536H53.6238ZM63.3327 122.774C63.2419 122.774 63.1784 122.733 63.1421 122.652L61.4399 118.883C61.4218 118.846 61.3946 118.828 61.3582 118.828H60.0919C60.0465 118.828 60.0238 118.851 60.0238 118.896V122.611C60.0238 122.656 60.0056 122.692 59.9693 122.72C59.9421 122.756 59.9058 122.774 59.8604 122.774H58.2672C58.2218 122.774 58.1809 122.756 58.1446 122.72C58.1174 122.692 58.1038 122.656 58.1038 122.611V113.413C58.1038 113.367 58.1174 113.331 58.1446 113.304C58.1809 113.268 58.2218 113.249 58.2672 113.249H62.1617C62.7426 113.249 63.251 113.367 63.6868 113.603C64.1316 113.839 64.472 114.175 64.708 114.61C64.9531 115.046 65.0757 115.549 65.0757 116.12C65.0757 116.737 64.9214 117.263 64.6127 117.699C64.3041 118.143 63.8729 118.456 63.3191 118.638C63.2737 118.656 63.2601 118.688 63.2782 118.733L65.1302 122.584C65.1483 122.62 65.1574 122.647 65.1574 122.665C65.1574 122.738 65.1075 122.774 65.0076 122.774H63.3327ZM60.0919 114.896C60.0465 114.896 60.0238 114.919 60.0238 114.964V117.291C60.0238 117.336 60.0465 117.359 60.0919 117.359H61.8757C62.257 117.359 62.5656 117.245 62.8016 117.018C63.0468 116.792 63.1693 116.497 63.1693 116.134C63.1693 115.771 63.0468 115.472 62.8016 115.236C62.5656 115.009 62.257 114.896 61.8757 114.896H60.0919ZM66.628 122.774C66.5826 122.774 66.5463 122.756 66.5191 122.72C66.4828 122.692 66.4646 122.656 66.4646 122.611V113.413C66.4646 113.367 66.4828 113.331 66.5191 113.304C66.5463 113.268 66.5826 113.249 66.628 113.249H68.2212C68.2666 113.249 68.3075 113.268 68.3438 113.304C68.371 113.331 68.3846 113.367 68.3846 113.413V122.611C68.3846 122.656 68.371 122.692 68.3438 122.72C68.3075 122.756 68.2666 122.774 68.2212 122.774H66.628ZM75.5199 113.413C75.5199 113.367 75.5381 113.331 75.5744 113.304C75.6017 113.268 75.638 113.249 75.6834 113.249H77.2765C77.3219 113.249 77.3628 113.268 77.3991 113.304C77.4263 113.331 77.4399 113.367 77.4399 113.413V122.611C77.4399 122.656 77.4263 122.692 77.3991 122.72C77.3628 122.756 77.3219 122.774 77.2765 122.774H75.7378C75.647 122.774 75.5835 122.738 75.5472 122.665L72.0204 116.842C72.0022 116.814 71.9841 116.805 71.9659 116.814C71.9477 116.814 71.9387 116.833 71.9387 116.869L71.9659 122.611C71.9659 122.656 71.9523 122.692 71.9251 122.72C71.8887 122.756 71.8479 122.774 71.8025 122.774H70.2093C70.1639 122.774 70.1276 122.756 70.1004 122.72C70.0641 122.692 70.0459 122.656 70.0459 122.611V113.413C70.0459 113.367 70.0641 113.331 70.1004 113.304C70.1276 113.268 70.1639 113.249 70.2093 113.249H71.748C71.8388 113.249 71.9024 113.286 71.9387 113.358L75.4519 119.155C75.47 119.182 75.4882 119.191 75.5063 119.182C75.5245 119.182 75.5336 119.164 75.5336 119.127L75.5199 113.413ZM82.451 122.883C81.752 122.883 81.1347 122.742 80.5991 122.461C80.0635 122.18 79.6504 121.79 79.3599 121.291C79.0604 120.783 78.9106 120.198 78.9106 119.536V116.488C78.9106 115.826 79.0604 115.241 79.3599 114.733C79.6504 114.225 80.0635 113.83 80.5991 113.549C81.1347 113.277 81.752 113.141 82.451 113.141C83.1409 113.141 83.7537 113.277 84.2893 113.549C84.8158 113.821 85.2289 114.193 85.5285 114.665C85.819 115.127 85.9642 115.644 85.9642 116.216V116.311C85.9642 116.356 85.9506 116.393 85.9234 116.42C85.887 116.456 85.8462 116.474 85.8008 116.474H84.2076C84.1622 116.474 84.1259 116.456 84.0987 116.42C84.0624 116.393 84.0442 116.356 84.0442 116.311V116.27C84.0442 115.853 83.899 115.504 83.6085 115.222C83.318 114.932 82.9321 114.787 82.451 114.787C81.9608 114.787 81.5704 114.937 81.2799 115.236C80.9804 115.544 80.8306 115.944 80.8306 116.433V119.59C80.8306 120.08 80.9894 120.475 81.3072 120.774C81.6249 121.082 82.0289 121.237 82.5191 121.237C82.9911 121.237 83.3679 121.11 83.6493 120.856C83.9307 120.611 84.0714 120.266 84.0714 119.821V119.209C84.0714 119.164 84.0487 119.141 84.0033 119.141H82.4782C82.4329 119.141 82.3965 119.123 82.3693 119.087C82.333 119.059 82.3148 119.023 82.3148 118.978V117.726C82.3148 117.681 82.333 117.644 82.3693 117.617C82.3965 117.581 82.4329 117.563 82.4782 117.563H85.8008C85.8462 117.563 85.887 117.581 85.9234 117.617C85.9506 117.644 85.9642 117.681 85.9642 117.726V119.522C85.9642 120.211 85.819 120.81 85.5285 121.318C85.238 121.826 84.8295 122.216 84.3029 122.488C83.7673 122.751 83.15 122.883 82.451 122.883ZM51.8263 133.836C51.8082 133.854 51.8036 133.872 51.8127 133.891C51.8218 133.909 51.8399 133.918 51.8672 133.918H55.5574C55.6028 133.918 55.6436 133.931 55.6799 133.959C55.7072 133.995 55.7208 134.036 55.7208 134.081V135.401C55.7208 135.446 55.7072 135.483 55.6799 135.51C55.6436 135.546 55.6028 135.564 55.5574 135.564H49.4297C49.3843 135.564 49.3435 135.546 49.3072 135.51C49.2799 135.483 49.2663 135.446 49.2663 135.401V134.149C49.2663 134.067 49.2936 133.999 49.348 133.945C49.7929 133.51 50.2468 133.038 50.7097 132.53C51.1727 132.013 51.4632 131.691 51.5812 131.564C51.8354 131.265 52.0941 130.979 52.3574 130.707C53.1835 129.79 53.5965 129.11 53.5965 128.666C53.5965 128.348 53.4831 128.085 53.2561 127.877C53.0292 127.677 52.7341 127.577 52.371 127.577C52.0079 127.577 51.7129 127.677 51.4859 127.877C51.259 128.085 51.1455 128.357 51.1455 128.693V129.033C51.1455 129.078 51.1273 129.119 51.091 129.156C51.0638 129.183 51.0275 129.196 50.9821 129.196H49.3753C49.3299 129.196 49.2936 129.183 49.2663 129.156C49.23 129.119 49.2119 129.078 49.2119 129.033V128.394C49.2391 127.904 49.3934 127.468 49.6748 127.087C49.9563 126.715 50.3285 126.43 50.7914 126.23C51.2635 126.031 51.79 125.931 52.371 125.931C53.0155 125.931 53.5784 126.049 54.0595 126.285C54.5316 126.529 54.8992 126.856 55.1625 127.264C55.4167 127.672 55.5438 128.126 55.5438 128.625C55.5438 129.006 55.4485 129.396 55.2578 129.795C55.0672 130.194 54.7812 130.625 54.3999 131.088C54.1185 131.441 53.8144 131.791 53.4876 132.135C53.1608 132.48 52.6751 132.979 52.0306 133.632L51.8263 133.836ZM60.1463 135.714C59.1477 135.714 58.358 135.433 57.777 134.87C57.196 134.317 56.9055 133.56 56.9055 132.598V129.006C56.9055 128.062 57.196 127.314 57.777 126.761C58.358 126.207 59.1477 125.931 60.1463 125.931C61.1449 125.931 61.9392 126.207 62.5293 126.761C63.1103 127.314 63.4008 128.062 63.4008 129.006V132.598C63.4008 133.56 63.1103 134.317 62.5293 134.87C61.9392 135.433 61.1449 135.714 60.1463 135.714ZM60.1463 134.067C60.5548 134.067 60.8816 133.94 61.1268 133.687C61.3628 133.442 61.4808 133.11 61.4808 132.693V128.951C61.4808 128.534 61.3628 128.203 61.1268 127.958C60.8816 127.704 60.5548 127.577 60.1463 127.577C59.7469 127.577 59.4292 127.704 59.1931 127.958C58.948 128.203 58.8255 128.534 58.8255 128.951V132.693C58.8255 133.11 58.948 133.442 59.1931 133.687C59.4292 133.94 59.7469 134.067 60.1463 134.067ZM67.2136 133.836C67.1954 133.854 67.1909 133.872 67.1999 133.891C67.209 133.909 67.2272 133.918 67.2544 133.918H70.9446C70.99 133.918 71.0309 133.931 71.0672 133.959C71.0944 133.995 71.108 134.036 71.108 134.081V135.401C71.108 135.446 71.0944 135.483 71.0672 135.51C71.0309 135.546 70.99 135.564 70.9446 135.564H64.817C64.7716 135.564 64.7353 135.546 64.708 135.51C64.6717 135.483 64.6536 135.446 64.6536 135.401V134.149C64.6536 134.067 64.6808 133.999 64.7353 133.945C65.1801 133.51 65.634 133.038 66.097 132.53C66.5599 132.013 66.8504 131.691 66.9685 131.564C67.2226 131.265 67.4814 130.979 67.7446 130.707C68.5707 129.79 68.9838 129.11 68.9838 128.666C68.9838 128.348 68.8703 128.085 68.6434 127.877C68.4164 127.677 68.1214 127.577 67.7582 127.577C67.3951 127.577 67.1001 127.677 66.8731 127.877C66.6462 128.085 66.5327 128.357 66.5327 128.693V129.033C66.5327 129.078 66.5191 129.119 66.4919 129.156C66.4556 129.183 66.4147 129.196 66.3693 129.196H64.7625C64.7171 129.196 64.6808 129.183 64.6536 129.156C64.6173 129.119 64.5991 129.078 64.5991 129.033V128.394C64.6263 127.904 64.7807 127.468 65.0621 127.087C65.3435 126.715 65.7202 126.43 66.1923 126.23C66.6553 126.031 67.1772 125.931 67.7582 125.931C68.4028 125.931 68.9656 126.049 69.4468 126.285C69.9188 126.529 70.2865 126.856 70.5497 127.264C70.8039 127.672 70.931 128.126 70.931 128.625C70.931 129.006 70.8357 129.396 70.6451 129.795C70.4544 130.194 70.1685 130.625 69.7872 131.088C69.5058 131.441 69.2017 131.791 68.8748 132.135C68.548 132.48 68.0624 132.979 67.4178 133.632L67.2136 133.836ZM77.971 131.02C78.1526 131.437 78.2434 131.918 78.2434 132.462C78.2434 132.952 78.1616 133.405 77.9982 133.823C77.7804 134.403 77.4173 134.857 76.9089 135.183C76.3914 135.51 75.7832 135.673 75.0842 135.673C74.3943 135.673 73.7906 135.501 73.2731 135.156C72.7466 134.811 72.3699 134.344 72.1429 133.755C72.0158 133.401 71.9432 133.02 71.9251 132.612C71.9251 132.503 71.9795 132.448 72.0885 132.448H73.6953C73.8042 132.448 73.8587 132.503 73.8587 132.612C73.895 132.911 73.9449 133.133 74.0085 133.278C74.0902 133.514 74.2263 133.696 74.417 133.823C74.5985 133.959 74.8164 134.027 75.0706 134.027C75.579 134.027 75.9285 133.804 76.1191 133.36C76.2462 133.088 76.3097 132.77 76.3097 132.407C76.3097 131.981 76.2416 131.632 76.1055 131.36C75.8967 130.933 75.5472 130.72 75.057 130.72C74.9571 130.72 74.8527 130.747 74.7438 130.802C74.6348 130.865 74.5032 130.952 74.3489 131.06C74.3126 131.088 74.2763 131.101 74.2399 131.101C74.1855 131.101 74.1446 131.074 74.1174 131.02L73.314 129.89C73.2958 129.863 73.2868 129.831 73.2868 129.795C73.2868 129.741 73.3049 129.695 73.3412 129.659L75.5063 127.768C75.5245 127.75 75.5336 127.731 75.5336 127.713C75.5245 127.695 75.5063 127.686 75.4791 127.686H72.2791C72.2337 127.686 72.1974 127.668 72.1702 127.632C72.1338 127.604 72.1157 127.568 72.1157 127.523V126.203C72.1157 126.158 72.1338 126.121 72.1702 126.094C72.1974 126.058 72.2337 126.04 72.2791 126.04H77.9574C78.0028 126.04 78.0436 126.058 78.0799 126.094C78.1072 126.121 78.1208 126.158 78.1208 126.203V127.7C78.1208 127.772 78.089 127.84 78.0255 127.904L76.2417 129.537C76.2235 129.555 76.219 129.573 76.228 129.591C76.228 129.609 76.2462 129.618 76.2825 129.618C77.0723 129.772 77.6351 130.24 77.971 131.02Z" fill="#252530"/>
</svg>
