﻿List,Group,Sub-group
Most active in US,lenders,geog
Most active in Great Lakes,lenders,geog_us
Most active in Mid-Atlantic,lenders,geog_us
Most active in Midwest,lenders,geog_us
Most active in Mountain,lenders,geog_us
Most active in New England,lenders,geog_us
Most active in South,lenders,geog_us
Most active in Southeast,lenders,geog_us
Most active in West Coast,lenders,geog_us
B2B,lenders,industry
B2C,lenders,industry
Healthcare,lenders,industry
IT,lenders,industry
Energy,lenders,industry
Financial services,lenders,industry
Material resources,lenders,industry
Most active lenders in US buyouts,lenders,deal_type
Most active lenders in US secondary buyouts,lenders,deal_type
Most active lenders in US add-ons,lenders,deal_type
"Most active lenders in US buyouts, select roles",lenders,deal_type_select_roles
"Most active lenders in US secondary buyouts, select roles",lenders,deal_type_select_roles
"Most active lenders in US add-ons, select roles",lenders,deal_type_select_roles
Most active lenders to US PE companies in general debt,lenders,debt_type
Most active lenders to US PE companies in senior debt,lenders,debt_type
Most active lenders to US PE companies in revolvers,lenders,debt_type
Most active in Europe,lenders,geog
Most active in Central & Eastern Europe,lenders,geog_eur
Most active in France & Benelux,lenders,geog_eur
Most active in DACH,lenders,geog_eur
Most active in Nordics,lenders,geog_eur
Most active in Southern Europe,lenders,geog_eur
Most active in UK & Ireland,lenders,geog_eur
Most active law firms in US PE debt deals,lenders,lawfirms
