Division,WeightClassKg,Place,Name,Team,BodyweightKg,Best3SquatKg,Best3BenchKg,Best3DeadliftKg,TotalKg,Equipment,Event,Sex,BirthDate
Boys,51.71,1,Matthew McFadden,Ferris,51.26,104.33,63.5,127.01,294.84,Single-ply,SBD,M,
Boys,55.79,1,Caleb Quiroz,Ferris,55.79,97.52,43.09,102.06,242.67,Single-ply,SBD,M,
Boys,59.87,1,Payton Fields,Red Oak,59.42,170.1,95.25,154.22,419.57,Single-ply,SBD,M,
Boys,67.13,1,Jesse Ovalle,Ennis,65.32,165.56,117.93,181.44,464.93,Single-ply,SBD,M,
Boys,67.13,2,Andrew Zuniga,Red Oak,64.41,163.29,108.86,172.37,444.52,Single-ply,SBD,M,
Boys,67.13,3,Tristan Perry,Ennis,61.69,163.29,99.79,154.22,417.3,Single-ply,SBD,M,
Boys,67.13,DQ,Jack Sutton,Ennis,66.68,170.1,115.67,,,Single-ply,SBD,M,
Boys,74.84,1,Max Sellers,Ennis,69.85,204.12,131.54,183.7,519.36,Single-ply,SBD,M,
Boys,74.84,2,Kadin Juarez,Ennis,71.21,176.9,115.67,181.44,474,Single-ply,SBD,M,
Boys,82.1,1,Derrick Willis,Ferris,80.29,249.48,142.88,240.4,632.76,Single-ply,SBD,M,
Boys,82.1,DQ,Julian Duran,Red Oak,79.83,,,,,Single-ply,SBD,M,
Boys,89.81,1,Ethan Colvin,Ferris,82.55,215.46,136.08,204.12,555.65,Single-ply,SBD,M,
Boys,89.81,2,Bryten Fields,Ennis,89.81,192.78,142.88,208.65,544.31,Single-ply,SBD,M,
Boys,89.81,3,Jacob Saenz,Ennis,88.9,183.7,149.69,192.78,526.17,Single-ply,SBD,M,
Boys,99.79,1,Lucas Hagler,Ennis,97.98,244.94,170.1,242.67,657.71,Single-ply,SBD,M,
Boys,99.79,2,Patlan Mendez,Ennis,97.98,226.8,138.35,204.12,569.26,Single-ply,SBD,M,
Boys,109.77,1,Marc Anthony Calderon,Ferris,100.24,226.8,136.08,204.12,566.99,Single-ply,SBD,M,
Boys,109.77,2,Joseph Hutson,Ferris,109.32,210.92,147.42,188.24,546.58,Single-ply,SBD,M,
Boys,109.77,3,Brock Links,Red Oak,107.5,185.97,115.67,226.8,528.44,Single-ply,SBD,M,
Boys,124.74,1,Gabe Dickey,Red Oak,112.49,179.17,113.4,179.17,471.74,Single-ply,SBD,M,
Boys,124.74,DQ,Chris Ramos,Red Oak,118.39,,,,,Single-ply,SBD,M,
Boys,139.71,1,Matthew Quiroz,Ferris,125.65,290.3,174.63,192.78,657.71,Single-ply,SBD,M,
Boys,139.71,2,Gavin Shook,Red Oak,136.53,183.7,124.74,192.78,501.22,Single-ply,SBD,M,
Boys,139.71+,1,Joseph Fuentes,Ferris,140.61,272.16,185.97,249.48,707.6,Single-ply,SBD,M,
