Place,Sex,Name,Event,Division,WeightClassKg,Equipment,BirthYear,State,BodyweightKg,Squat1Kg,Squat2Kg,Squat3Kg,Best3SquatKg,Bench1Kg,Bench2Kg,Bench3Kg,Best3BenchKg,Deadlift1Kg,Deadlift2Kg,Deadlift3Kg,Best3DeadliftKg,TotalKg
1,M,Bill Campbell,B,M-M3,120+,Single-ply,1957,GA,152.50,,,,,185,-285,-290,185.0,,,,,185
1,M,Bill Campbell,B,M-O,120+,Single-ply,1957,GA,152.50,,,,,185,-285,-290,185.0,,,,,185
1,M,Stephen Smalls,B,MR-Jr,120,Raw,1996,GA,114.50,,,,,180,-185,-185,180.0,,,,,180
1,M,Caden Sikes,B,MR-O,74,Raw,1998,GA,70.40,,,,,100,107.5,117.5,117.5,,,,,117.5
1,M,Spencer Howell,B,MR-O,105,Raw,1988,GA,94.50,,,,,140,145,-150,145.0,,,,,145
1,M,Stephen Smalls,B,MR-O,120,Raw,1996,GA,114.50,,,,,180,-185,-185,180.0,,,,,180
1,M,Caden Sikes,B,MR-T3,74,Raw,1998,GA,70.40,,,,,100,107.5,117.5,117.5,,,,,117.5
1,F,Trina Pinkney,D,FR-M1,84+,Raw,1973,GA,112.50,,,,,,,,,195,200,-202.5,200.0,200
2,F,Marie Mire,D,FR-M1,84+,Raw,1972,SC,109.90,,,,,,,,,92.5,97.5,112.5,112.5,112.5
1,F,Nicole Malone,D,FR-O,72,Raw,1984,GA,69.90,,,,,,,,,115,117.5,122.5,122.5,122.5
1,F,Trina Pinkney,D,FR-O,84+,Raw,1973,GA,112.50,,,,,,,,,195,200,-202.5,200.0,200
2,F,Marie Mire,D,FR-O,84+,Raw,1972,SC,109.90,,,,,,,,,92.5,97.5,112.5,112.5,112.5
1,M,Evans Wallace IV,D,MR-O,105,Raw,2000,GA,98.70,,,,,,,,,100,137.5,150,150.0,150
1,M,Evans Wallace IV,D,MR-T2,105,Raw,2000,GA,98.70,,,,,,,,,100,137.5,150,150.0,150
1,F,TaMesha Robinson,SBD,FR-Jr,63,Raw,1995,GA,60.40,52.5,57.5,62.5,62.5,32.5,37.5,42.5,42.5,100,105,110,110.0,215
1,F,Amy Mason,SBD,FR-M1,63,Raw,1976,NC,62.70,107.5,117.5,127.5,127.5,60,-65,-65,60.0,117.5,130,140,140.0,327.5
1,F,Karina Espinosa,SBD,FR-M1,72,Raw,1974,GA,69.10,70,80,85,85.0,40,42.5,47.5,47.5,95,102.5,-110,102.5,235
1,F,Trina Pinkney,SBD,FR-M1,84+,Raw,1973,GA,112.50,-127.5,-135,140,140.0,80,85,-90,85.0,195,200,-202.5,200.0,425
2,F,Marie Mire,SBD,FR-M1,84+,Raw,1972,SC,109.90,70,72.5,75,75.0,-47.5,-50,52.5,52.5,92.5,97.5,112.5,112.5,240
1,F,Bianca White,SBD,FR-M2,72,Raw,1959,GA,71.80,57.5,60,65,65.0,45,50,-52.5,50.0,-92.5,92.5,-97.5,92.5,207.5
1,F,Heidi Schaffner,SBD,FR-M2,84+,Raw,1965,GA,105.50,-85,87.5,-90,87.5,45,47.5,-52.5,47.5,117.5,125,-135,125.0,260
1,F,Ashley Childs,SBD,FR-M3,52,Raw,1950,GA,48.80,-50,-50,52.5,52.5,32.5,37.5,-40,37.5,70,75,82.5,82.5,172.5
1,F,Ashley Childs,SBD,FR-O,52,Raw,1950,GA,48.80,-50,-50,52.5,52.5,32.5,37.5,-40,37.5,70,75,82.5,82.5,172.5
2,F,Nicole Walker,SBD,FR-O,52,Raw,1983,GA,47.80,47.5,55,-57.5,55.0,30,-35,-35,30.0,60,67.5,-72.5,67.5,152.5
1,F,Christie Nix,SBD,FR-O,57,Raw,1981,GA,56.50,-97.5,100,107.5,107.5,57.5,-60,,57.5,122.5,132.5,145,145.0,310
2,F,Jordan Sandoval,SBD,FR-O,57,Raw,1990,GA,56.10,60,67.5,-75,67.5,32.5,35,37.5,37.5,92.5,102.5,-110,102.5,207.5
3,F,Yue Yin,SBD,FR-O,57,Raw,1988,GA,52.40,62.5,65,-67.5,65.0,30,32.5,-35,32.5,67.5,72.5,77.5,77.5,175
1,F,Nicole Higgins,SBD,FR-O,63,Raw,1996,NC,63.00,135,142.5,-152.5,142.5,72.5,-82.5,-82.5,72.5,155,167.5,170,170.0,385
2,F,Tara Thomas,SBD,FR-O,63,Raw,1990,FL,60.00,115,122.5,-127.5,122.5,62.5,65,-67.5,65.0,145,150,-155,150.0,337.5
3,F,Amy Mason,SBD,FR-O,63,Raw,1976,NC,62.70,107.5,117.5,127.5,127.5,60,-65,-65,60.0,117.5,130,140,140.0,327.5
4,F,Amanda Herring,SBD,FR-O,63,Raw,1988,GA,61.90,82.5,85,87.5,87.5,50,52.5,57.5,57.5,92.5,97.5,100,100.0,245
5,F,Penny Hadgeoff,SBD,FR-O,63,Raw,1962,SC,63.00,75,-87.5,-92.5,75.0,47.5,52.5,55,55.0,95,105,112.5,112.5,242.5
6,F,TaMesha Robinson,SBD,FR-O,63,Raw,1995,GA,60.40,52.5,57.5,62.5,62.5,32.5,37.5,42.5,42.5,100,105,110,110.0,215
1,F,Katie Singletary,SBD,FR-O,72,Raw,1987,GA,70.80,97.5,107.5,-117.5,107.5,57.5,65,70,70.0,120,-132.5,-145,120.0,297.5
2,F,Nicole Malone,SBD,FR-O,72,Raw,1984,GA,69.90,97.5,100,-120,100.0,52.5,55,-60,55.0,115,117.5,122.5,122.5,277.5
3,F,Karina Espinosa,SBD,FR-O,72,Raw,1974,GA,69.10,70,80,85,85.0,40,42.5,47.5,47.5,95,102.5,-110,102.5,235
4,F,Bianca White,SBD,FR-O,72,Raw,1959,GA,71.80,57.5,60,65,65.0,45,50,-52.5,50.0,-92.5,92.5,-97.5,92.5,207.5
1,F,Dawn Tyson,SBD,FR-O,84,Raw,1985,GA,75.40,130,140,145,145.0,75,80,85,85.0,135,145,150,150.0,380
2,F,Elnaz Bahramyan,SBD,FR-O,84,Raw,1997,GA,81.10,-82.5,85,87.5,87.5,52.5,57.5,60,60.0,102.5,107.5,110,110.0,257.5
3,F,Jacqueline Chapman,SBD,FR-O,84,Raw,1985,GA,82.80,72.5,77.5,82.5,82.5,47.5,50,-55,50.0,112.5,117.5,120,120.0,252.5
4,F,Monica Petrozolin,SBD,FR-O,84,Raw,1986,GA,76.90,-55,55,-60,55.0,30,35,-37.5,35.0,65,67.5,70,70.0,160
1,F,Trina Pinkney,SBD,FR-O,84+,Raw,1973,GA,112.50,-127.5,-135,140,140.0,80,85,-90,85.0,195,200,-202.5,200.0,425
2,F,Ja'Nae Shelton,SBD,FR-O,84+,Raw,1990,GA,127.70,112.5,125,130,130.0,52.5,57.5,-60,57.5,125,140,-145,140.0,327.5
3,F,Heidi Schaffner,SBD,FR-O,84+,Raw,1965,GA,105.50,-85,87.5,-90,87.5,45,47.5,-52.5,47.5,117.5,125,-135,125.0,260
4,F,Marie Mire,SBD,FR-O,84+,Raw,1972,SC,109.90,70,72.5,75,75.0,-47.5,-50,52.5,52.5,92.5,97.5,112.5,112.5,240
DQ,F,Melody Sheffield,SBD,FR-O,84+,Raw,1989,GA,113.40,-110,-112.5,-112.5,,65,70,-77.5,70.0,120,127.5,135,135.0,
1,F,Elnaz Bahramyan,SBD,FR-T3,84,Raw,1997,GA,81.10,-82.5,85,87.5,87.5,52.5,57.5,60,60.0,102.5,107.5,110,110.0,257.5
1,M,Darious Stokes,SBD,MR-Jr,66,Raw,1996,GA,65.10,-157.5,170,-175,170.0,110,-117.5,-117.5,110.0,207.5,220,-227.5,220.0,500
1,M,TraShon Hightower,SBD,MR-Jr,74,Raw,1996,GA,73.20,230,-250,-250,230.0,130,145,-147.5,145.0,-227.5,230,232.5,232.5,607.5
1,M,Ian Ruffner,SBD,MR-Jr,83,Raw,1994,GA,75.60,-200,200,212.5,212.5,120,-125,-125,120.0,197.5,-207.5,-210,197.5,530
1,M,Austin Vater,SBD,MR-Jr,93,Raw,1993,SC,92.20,232.5,-250,250,250.0,140,147.5,-155,147.5,252.5,265,-275,265.0,662.5
2,M,Brian Warstadt,SBD,MR-Jr,93,Raw,1995,GA,85.70,167.5,175,185,185.0,105,112.5,120,120.0,175,190,205,205.0,510
DD,M,Tommy Cai,SBD,MR-Jr,105,Raw,1994,GA,103.50,-220,235,-245,235.0,115,130,137.5,137.5,250,270,-285,270.0,
1,M,Garrett Goolsby,SBD,MR-Jr,105,Raw,1996,GA,98.20,185,195,210,210.0,130,135,145,145.0,205,-220,-220,205.0,560
1,M,Jake Maselka,SBD,MR-Jr,120,Raw,1995,GA,111.10,215,225,250,250.0,-125,135,-140,135.0,230,250,275,275.0,660
2,M,Anthony Boza,SBD,MR-Jr,120,Raw,1996,GA,110.30,-205,215,-222.5,215.0,-175,185,-192.5,185.0,-225,230,-237.5,230.0,630
1,M,Dean Sabatinelli,SBD,MR-M1,74,Raw,1969,GA,74.00,125,135,-137.5,135.0,100,102.5,-105,102.5,165,185,-187.5,185.0,422.5
1,M,Jason Franklin,SBD,MR-M1,83,Raw,1973,GA,82.30,-152.5,-157.5,157.5,157.5,-130,130,-140,130.0,167.5,-180,180,180.0,467.5
1,M,Brian Cochran,SBD,MR-M1,105,Raw,1975,GA,104.70,-140,150,160,160.0,110,125,-135,125.0,170,182.5,-195,182.5,467.5
1,M,Sean Holcey,SBD,MR-M1,120,Raw,1974,GA,117.50,-200,205,212.5,212.5,140,150,-162.5,150.0,200,230,240,240.0,602.5
2,M,Stacy Hover,SBD,MR-M1,120,Raw,1975,GA,117.90,192.5,205,210,210.0,137.5,147.5,-155,147.5,182.5,195,-207.5,195.0,552.5
1,M,Jesse Jenkins,SBD,MR-M2,120,Raw,1966,GA,116.20,190,195,-197.5,195.0,135,140,145,145.0,192.5,197.5,200,200.0,540
1,M,Darious Stokes,SBD,MR-O,66,Raw,1996,GA,65.10,-157.5,170,-175,170.0,110,-117.5,-117.5,110.0,207.5,220,-227.5,220.0,500
2,M,Jonathan Padgett,SBD,MR-O,66,Raw,1992,GA,65.30,125,145,147.5,147.5,82.5,92.5,-95,92.5,165,185,-192.5,185.0,425
1,M,TraShon Hightower,SBD,MR-O,74,Raw,1996,GA,73.20,230,-250,-250,230.0,130,145,-147.5,145.0,-227.5,230,232.5,232.5,607.5
2,M,Caleb Moore #2,SBD,MR-O,74,Raw,1997,GA,71.00,165,170,-172.5,170.0,100,107.5,-110,107.5,197.5,-205,-222.5,197.5,475
3,M,Dean Sabatinelli,SBD,MR-O,74,Raw,1969,GA,74.00,125,135,-137.5,135.0,100,102.5,-105,102.5,165,185,-187.5,185.0,422.5
1,M,Ronald Medrano,SBD,MR-O,83,Raw,1992,LA,76.60,192.5,202.5,212.5,212.5,110,117.5,122.5,122.5,250,267.5,282.5,282.5,617.5
2,M,Ronnie Green,SBD,MR-O,83,Raw,,GA,81.60,220,-232.5,-232.5,220.0,145,150,-160,150.0,227.5,235,247.5,247.5,617.5
3,M,Matthew Boyce,SBD,MR-O,83,Raw,1996,GA,81.50,182.5,190,195,195.0,125,130,137.5,137.5,212.5,-217.5,,212.5,545
4,M,Chadd Charland,SBD,MR-O,83,Raw,1975,FL,83.00,185,-205,-205,185.0,125,-137.5,-137.5,125.0,230,-257.5,-257.5,230.0,540
5,M,Ian Ruffner,SBD,MR-O,83,Raw,1994,GA,75.60,-200,200,212.5,212.5,120,-125,-125,120.0,197.5,-207.5,-210,197.5,530
6,M,Jason Franklin,SBD,MR-O,83,Raw,1973,GA,82.30,-152.5,-157.5,157.5,157.5,-130,130,-140,130.0,167.5,-180,180,180.0,467.5
7,M,Bruce Kinsey,SBD,MR-O,83,Raw,1988,FL,78.20,145,150,162.5,162.5,-85,87.5,-92.5,87.5,152.5,170,180,180.0,430
1,M,Austin Vater,SBD,MR-O,93,Raw,1993,SC,92.20,232.5,-250,250,250.0,140,147.5,-155,147.5,252.5,265,-275,265.0,662.5
2,M,Cody Large,SBD,MR-O,93,Raw,1986,FL,91.50,227.5,240,-245,240.0,142.5,-147.5,-150,142.5,260,275,-282.5,275.0,657.5
3,M,John Dorman,SBD,MR-O,93,Raw,1990,FL,88.40,215,230,232.5,232.5,147.5,-155,-155,147.5,247.5,260,272.5,272.5,652.5
4,M,Jacob Strong,SBD,MR-O,93,Raw,1999,FL,90.00,180,190,202.5,202.5,135,142.5,150,150.0,200,210,220,220.0,572.5
5,M,Blake Mabry,SBD,MR-O,93,Raw,1997,GA,87.30,165,175,182.5,182.5,125,130,140,140.0,200,217.5,222.5,222.5,545
6,M,Taylor Lewis #2,SBD,MR-O,93,Raw,1992,FL,88.20,177.5,187.5,192.5,192.5,115,122.5,127.5,127.5,197.5,207.5,215,215.0,535
7,M,Boltin Kehrt,SBD,MR-O,93,Raw,1991,GA,91.50,175,182.5,-195,182.5,110,117.5,125,125.0,200,210,-227.5,210.0,517.5
8,M,Brian Warstadt,SBD,MR-O,93,Raw,1995,GA,85.70,167.5,175,185,185.0,105,112.5,120,120.0,175,190,205,205.0,510
9,M,Kyle Clavier,SBD,MR-O,93,Raw,1993,FL,91.50,165,-175,-182.5,165.0,122.5,137.5,-142.5,137.5,182.5,200,-215,200.0,502.5
10,M,Steven Hancock,SBD,MR-O,93,Raw,1994,GA,91.10,160,170,172.5,172.5,95,100,102.5,102.5,202.5,210,-215,210.0,485
11,M,Christopher Quach,SBD,MR-O,93,Raw,1998,GA,85.20,112.5,117.5,125,125.0,-72.5,75,-80,75.0,152.5,160,-182.5,160.0,360
1,M,Grant Barnett,SBD,MR-O,105,Raw,1993,GA,103.10,-250,265,275,275.0,160,167.5,170,170.0,252.5,267.5,275,275.0,720
2,M,Scott Acosta,SBD,MR-O,105,Raw,1982,GA,96.80,210,222.5,230,230.0,157.5,165,170,170.0,240,257.5,265,265.0,665
DD,M,Tommy Cai,SBD,MR-O,105,Raw,1994,GA,103.50,-220,235,-245,235.0,115,130,137.5,137.5,250,270,-285,270.0,
3,M,Cason Dremann,SBD,MR-O,105,Raw,1989,GA,103.30,202.5,217.5,225,225.0,135,142.5,-147.5,142.5,250,265,272.5,272.5,640
4,M,Mykwan Roebuck,SBD,MR-O,105,Raw,1994,GA,95.90,205,212.5,-230,212.5,140,145,157.5,157.5,235,245,-272.5,245.0,615
5,M,Garrett Goolsby,SBD,MR-O,105,Raw,1996,GA,98.20,185,195,210,210.0,130,135,145,145.0,205,-220,-220,205.0,560
6,M,Alan Malone,SBD,MR-O,105,Raw,1984,GA,104.70,-127.5,-140,140,140.0,115,137.5,160,160.0,155,182.5,200,200.0,500
7,M,Brian Cochran,SBD,MR-O,105,Raw,1975,GA,104.70,-140,150,160,160.0,110,125,-135,125.0,170,182.5,-195,182.5,467.5
8,M,Connor Jenkins,SBD,MR-O,105,Raw,2002,GA,103.20,-87.5,97.5,105,105.0,52.5,65,67.5,67.5,102.5,110,122.5,122.5,295
1,M,Jake Maselka,SBD,MR-O,120,Raw,1995,GA,111.10,215,225,250,250.0,-125,135,-140,135.0,230,250,275,275.0,660
2,M,Nathaniel Korpusik,SBD,MR-O,120,Raw,1981,GA,120.00,-205,205,220,220.0,170,182.5,190,190.0,205,212.5,227.5,227.5,637.5
3,M,Anthony Boza,SBD,MR-O,120,Raw,1996,GA,110.30,-205,215,-222.5,215.0,-175,185,-192.5,185.0,-225,230,-237.5,230.0,630
4,M,Sean Holcey,SBD,MR-O,120,Raw,1974,GA,117.50,-200,205,212.5,212.5,140,150,-162.5,150.0,200,230,240,240.0,602.5
5,M,Benjamin Fordham,SBD,MR-O,120,Raw,1978,GA,110.60,170,182.5,190,190.0,140,152.5,160,160.0,205,220,230,230.0,580
6,M,Stacy Hover,SBD,MR-O,120,Raw,1975,GA,117.90,192.5,205,210,210.0,137.5,147.5,-155,147.5,182.5,195,-207.5,195.0,552.5
7,M,Jesse Jenkins,SBD,MR-O,120,Raw,1966,GA,116.20,190,195,-197.5,195.0,135,140,145,145.0,192.5,197.5,200,200.0,540
1,M,Walter Evans,SBD,MR-O,120+,Raw,1984,GA,134.40,250,260,-272.5,260.0,162.5,-182.5,-182.5,162.5,247.5,272.5,287.5,287.5,710
1,M,Connor Jenkins,SBD,MR-T1,105,Raw,2002,GA,103.20,-87.5,97.5,105,105.0,52.5,65,67.5,67.5,102.5,110,122.5,122.5,295
1,M,Jacob Strong,SBD,MR-T2,93,Raw,1999,FL,90.00,180,190,202.5,202.5,135,142.5,150,150.0,200,210,220,220.0,572.5
1,F,Christie Nix,BD,FR-O,57,Raw,1981,GA,56.50,,,,,57.5,-60,,57.5,122.5,132.5,145,145.0,202.5
1,F,Katie Singletary,BD,FR-O,72,Raw,1987,GA,70.80,,,,,57.5,65,70,70.0,120,-132.5,-145,120.0,190
2,F,Nicole Malone,BD,FR-O,72,Raw,1984,GA,69.90,,,,,52.5,55,-60,55.0,115,117.5,122.5,122.5,177.5
DQ,M,Troy Cannon,BD,MR-O,83,Raw,1983,GA,80.10,,,,,125,127.5,-130,127.5,-182.5,-182.5,-182.5,,
1,M,Spencer Howell,BD,MR-O,105,Raw,1988,GA,94.50,,,,,140,145,-150,145.0,210,227.5,235,235.0,380
2,M,Eli Smith,BD,MR-O,105,Raw,1985,GA,101.20,,,,,125,-145,-145,125.0,227.5,250,-272.5,250.0,375
3,M,Alan Malone,BD,MR-O,105,Raw,1984,GA,104.70,,,,,115,137.5,160,160.0,155,182.5,200,200.0,360
