Place,Name,Sex,State,Equipment,Division,BodyweightKg,WeightClassKg,Squat1Kg,Squat2Kg,Squat3Kg,Best3SquatKg,Bench1Kg,Bench2Kg,Bench3Kg,Best3BenchKg,Deadlift1Kg,Deadlift2Kg,Deadlift3Kg,Best3DeadliftKg,TotalKg,Event,BirthDate
2,Hannah Gregory,F,IN,Raw,F_OR_APF,79.61,82.5,97.52,106.59,-449.06,106.59,54.43,-61.23,-61.23,54.43,-142.88,142.88,156.49,156.49,317.51,SBD,
1,Sydney Hester,F,,Raw,F_JR_APF,74.84,75,108.86,122.47,-136.08,122.47,61.23,-68.04,-68.04,61.23,129.27,138.35,-145.15,138.35,322.05,SBD,
DQ,Heidi Schuck,F,IN,Raw,F_OR_APF,51.21,52,102.06,-113.4,-113.4,102.06,61.23,-68.04,-68.04,61.23,-129.27,-145.15,-145.15,,,SBD,
1,Tori Prouse,F,IN,Raw,F_OR_APF,71.8,75,131.54,-142.88,142.88,142.88,63.5,-72.57,-72.57,63.5,136.08,149.69,158.76,158.76,365.14,SBD,
1,Jessica Durden,F,IN,Raw,F_OR_APF,81.74,82.5,-197.31,201.85,-206.38,201.85,83.91,90.72,95.25,95.25,181.44,192.78,-199.58,192.78,489.88,SBD,
1,Emily Merritt,F,IN,Raw,F_OR_APF,95.57,100,204.12,217.72,226.8,226.8,102.06,108.86,-115.67,108.86,174.63,192.78,-208.65,192.78,528.44,SBD,
1,Sarah Buckley,F,IN,Multi-ply,F_OEM_APF,82.6,90,235.87,251.74,265.35,265.35,136.08,-145.15,147.42,147.42,192.78,-201.85,201.85,201.85,614.62,SBD,
1,Kena Lanham,F,IN,Raw,F_OR_APF,65.91,67.5,,,,,40.82,47.63,-54.43,47.63,,,,,47.63,B,
1,Katrina Wiseman,F,IN,Raw,F_OR_APF,78.61,82.5,,,,,,,,,174.63,185.97,-199.58,185.97,185.97,D,
1,Daniel Haines,M,IN,Raw,M_JR_APF,108.95,110,192.78,-204.12,-204.12,192.78,131.54,140.61,-147.42,140.61,219.99,233.6,238.14,238.14,571.53,SBD,
1,Luke Kiser,M,,Raw,M_JR_APF,122.24,125,210.92,219.99,226.8,226.8,147.42,154.22,158.76,158.76,251.74,263.08,272.16,272.16,657.71,SBD,
1,Joseph Barnes,M,IN,Raw,M_JR_APF,141.48,140+,238.14,249.48,258.55,258.55,185.97,192.78,197.31,197.31,256.28,267.62,-281.23,267.62,723.48,SBD,
NS,Dustin Query,M,IN,Raw,M_OR_APF,,,,,,,,,,,,,,,,SBD,
1,Jeremy Helton,M,IN,Raw,M_OR_APF,66.45,67.5,124.74,129.27,-131.54,129.27,97.52,102.06,-104.33,102.06,147.42,156.49,161.03,161.03,392.36,SBD,
1,Cameron Mcatee,M,IN,Raw,M_OR_APF,91.31,100,183.7,190.51,201.85,201.85,131.54,145.15,151.95,151.95,210.92,219.99,-226.8,219.99,573.79,SBD,
3,Nick Osborne,M,IN,Raw,M_OR_APF,95.98,100,170.1,181.44,-199.58,181.44,102.06,115.67,-127.01,115.67,181.44,201.85,217.72,217.72,514.83,SBD,
1,Chase Berhrman,M,IN,Raw,M_OR_APF,108.18,110,215.46,229.06,-238.14,229.06,156.49,170.1,-183.7,170.1,249.48,265.35,-274.42,265.35,664.51,SBD,
1,Jeremy Helton,M,IN,Raw,M_SR_APF,66.45,67.5,124.74,129.27,-131.54,129.27,97.52,102.06,-104.33,102.06,147.42,156.49,161.03,161.03,392.36,SBD,
1,Harrison Meyers,M,IN,Raw,M_TR_3_APF,97.66,100,90.72,-102.06,102.06,102.06,-61.23,61.23,63.5,63.5,140.61,147.42,154.22,154.22,319.78,SBD,
NS,Andrew Brown #17,M,IN,Raw,M_JR_APF,,,,,,,,,,,,,,,,SBD,
1,David Sebree,M,IN,Raw,M_JR_APF,74.21,75,-158.76,158.76,-170.1,158.76,102.06,-108.86,-108.86,102.06,165.56,181.44,192.78,192.78,453.59,SBD,
2,Wyatt Keller,M,,Raw,M_JR_APF,107,110,163.29,172.37,-179.17,172.37,97.52,-102.06,102.06,102.06,188.24,206.38,219.99,219.99,494.42,SBD,
1,James Leach,M,IN,Raw,M_MR_3_APF,98.75,100,215.46,226.8,238.14,238.14,124.74,136.08,145.15,145.15,215.46,229.06,240.4,240.4,623.69,SBD,
1,Pete Andrich,M,IN,Raw,M_MR_3_APF,134.99,140,206.38,-226.8,226.8,226.8,124.74,142.88,147.42,147.42,183.7,206.38,215.46,215.46,589.67,SBD,
1,Hayden Maggio,M,IN,Raw,M_OR_APF,74.48,75,142.88,-151.95,151.95,151.95,-106.59,106.59,111.13,111.13,183.7,188.24,-195.04,188.24,451.32,SBD,
2,Tucker Settle,M,IN,Raw,M_OR_APF,74.07,75,136.08,-140.61,-140.61,136.08,92.99,95.25,-99.79,95.25,138.35,145.15,149.69,149.69,381.02,SBD,
1,Brandon Pittenger,M,,Raw,M_OR_APF,88.63,90,235.87,249.48,258.55,258.55,142.88,149.69,-158.76,149.69,244.94,265.35,272.16,272.16,680.39,SBD,
2,Cordell Glass,M,IN,Raw,M_OR_APF,89.09,90,206.38,217.72,226.8,226.8,-124.74,133.81,-138.35,133.81,247.21,-251.74,-449.06,247.21,607.81,SBD,
3,Justin Jones,M,,Raw,M_OR_APF,89.36,90,151.95,161.03,167.83,167.83,102.06,111.13,-117.93,111.13,183.7,206.38,226.8,226.8,505.76,SBD,
4,Connor Graham,M,IN,Raw,M_OR_APF,89.49,90,-106.59,106.59,113.4,113.4,72.57,77.11,81.65,81.65,120.2,129.27,138.35,138.35,333.39,SBD,
2,JP Benitez,M,IN,Raw,M_OR_APF,94.26,100,185.97,204.12,-215.46,204.12,102.06,-449.06,-449.06,102.06,229.06,244.94,-251.74,244.94,551.11,SBD,
4,Joe Kaiser,M,IN,Raw,M_OR_APF,95.07,100,113.4,127.01,138.35,138.35,86.18,90.72,95.25,95.25,165.56,174.63,181.44,181.44,415.04,SBD,
1,Derrick Jenkins,M,IN,Raw,M_OR_APF,118.43,125,288.03,-303.91,-310.71,288.03,158.76,170.1,-181.44,170.1,254.01,-272.16,-272.16,254.01,712.14,SBD,
1,Aaron Day,M,,Raw,M_TR_2_APF,107.91,110,174.63,183.7,-192.78,183.7,102.06,108.86,-117.93,108.86,183.7,195.04,199.58,199.58,492.15,SBD,
1,Brian McNally,M,IN,Multi-ply,M_OEM_APF,137.85,140,340.19,-362.87,-362.87,340.19,247.21,-258.55,258.55,258.55,247.21,265.35,272.16,272.16,870.9,SBD,
DQ,Jonathan Shaff,M,IN,Raw,M_TR_2_APF,90.54,100,,,,,-102.06,115.67,-127.01,115.67,-174.63,-449.06,-449.06,,,BD,
1,Dan Sutton,M,IN,Multi-ply,M_OEM_APF,88.22,90,,,,,,,,,-251.74,251.74,-272.16,251.74,251.74,D,
