..........
----------------------------------------------------------------------
Ran 10 tests in 0.001s

OK
Name               Stmts   Miss Branch BrPart  Cover   Missing
--------------------------------------------------------------
Diplomacy.py          65      0     48      0   100%
TestDiplomacy.py      45      0      0      0   100%
--------------------------------------------------------------
TOTAL                110      0     48      0   100%
