.........................................
----------------------------------------------------------------------
Ran 41 tests in 0.007s

OK
Name               Stmts   Miss Branch BrPart  Cover   Missing
--------------------------------------------------------------
Diplomacy.py         137      0     72      0   100%
TestDiplomacy.py     224      0      0      0   100%
--------------------------------------------------------------
TOTAL                361      0     72      0   100%
