.............
----------------------------------------------------------------------
Ran 13 tests in 0.001s

OK
Name               Stmts   Miss Branch BrPart  Cover   Missing
--------------------------------------------------------------
Diplomacy.py          62      0     36      0   100%
TestDiplomacy.py     109      0      2      1    99%   132->exit
--------------------------------------------------------------
TOTAL                171      0     38      1    99%
