................
----------------------------------------------------------------------
Ran 16 tests in 0.018s

OK
Name               Stmts   Miss Branch BrPart  Cover   Missing
--------------------------------------------------------------
Diplomacy.py          78      1     48      6    94%   23->27, 28->32, 55->65, 101->102, 102, 109->72, 116->114
TestDiplomacy.py      79      0      2      1    99%   119->exit
--------------------------------------------------------------
TOTAL                157      1     50      7    96%
