.....
----------------------------------------------------------------------
Ran 5 tests in 0.001s

OK
Name               Stmts   Miss Branch BrPart  Cover   Missing
--------------------------------------------------------------
Diplomacy.py          67      2     42      2    96%   28->29, 29, 38->39, 39
TestDiplomacy.py      31      0      2      1    97%   55->exit
--------------------------------------------------------------
TOTAL                 98      2     44      3    96%
