.................
----------------------------------------------------------------------
Ran 17 tests in 0.011s

OK
Name               Stmts   Miss Branch BrPart  Cover   Missing
--------------------------------------------------------------
Diplomacy.py          65      4     44      3    92%   53->24, 54->72, 63->64, 64, 72-75
TestDiplomacy.py      71      0      0      0   100%
--------------------------------------------------------------
TOTAL                136      4     44      3    95%
