1 10 20
100 200 125
201 210 89
900 1000 174
1 1 1
13 14 18
100 90 119
273 129 128
23 1073 179
102 105 88
111 333 144
902 2 179
469 975 179
143 486 144
711 2019 182
516 2017 182
153 176 125
919 2001 182
1130 2000 182
9876 5432 262
234 20 128
883 229 179
59202 2394 340
293 2939 217
860 182 171
2341 383 183
3805 947 238
8204 2829 262
22 384 144
773 205 171
83 382 144
857 2929 217
928 4 179
2920 234 217
755 443 171
401 600 142
392 584 142
34 3949 238
685 4958 238
23498 345 279
58 3492 217
394 2930 217
6333 2920 262
238 2381 183
575 383 142
4839 4840 166
890 876 148
6300 4800 262
329 2954 217
398 576 142
5420 3483 238
239 485 144
47 68 113
483 48 144
95 28 116
1 1234 182
4390 483 238
872 5399 238
8078 34 262
70 567 144
22 99 119
234 9720 262
3495 384 217
5790 34 238
184 5091 238
578 3980 238
105 489 144
5765 4 238
43 2099 182
12 89 116
987 652 179
88 7768 262
575 3933 238
4 7382 262
749 3 171
43 9 112
678 209 145
1837 2499 209
1091 42 179
6749 738 262
473 954 179
139 283 128
44 4444 238
8 656 145
84 2309 183
458 470 129
345 350 126
1242 1252 177
874 889 148
904 890 117
567 543 137
123 901 179
457 38 144
8888 3425 262
294 3 128
2902 43 209
5768 390 238
20 9308 262
209 48 125
345 4 144
605293 606510 341
956739 956006 352
826611 825983 313
756134 756776 362
478642 479101 338
815892 815933 269
719220 719135 274
929349 929040 339
948351 948681 326
491808 491202 320
504516 507852 382
604712 604712 67
436809 436182 325
630804 630542 310
975948 975688 334
945718 945752 202
747700 747747 243
652581 653137 336
824003 823974 238
655077 655161 186
567537 567893 346
851101 851038 238
524621 524569 302
549210 549073 240
782205 782263 287
422252 422691 325
285142 285524 376
478472 479285 338
485461 484957 320
748121 748121 256
823874 824088 238
359661 358904 317
388654 388444 299
981428 981459 184
830977 832487 419
654572 654612 248
240125 241624 368
532347 536933 377
545105 545167 209
850670 851113 357
978562 976960 383
319662 322868 371
560495 559981 359
831101 831011 251
784445 782843 331
859271 859331 295
998394 998498 277
975465 975228 228
687538 680880 398
786313 786051 269
780568 780732 300
363174 361163 361
261481 261858 288
908012 909802 370
984442 984350 246
931890 931544 277
788836 791387 406
919454 919499 202
575642 575716 297
915504 916839 339
285788 285880 252
919365 918704 339
827554 827930 313
850429 850334 313
737959 737960 150
809210 810518 406
974713 974143 321
456486 455019 338
727712 727631 287
743706 745566 318
465147 463724 338
945152 944673 352
776248 775948 331
541191 542743 364
256518 255672 332
947523 950576 383
423648 421688 356
574485 575669 328
588113 587943 266
748123 748033 318
930036 929896 264
982165 982843 383
806280 806281 70
379341 379868 361
155281 158691 383
854261 855194 357
827665 827456 419
806029 805322 375
276791 280194 389
655238 655329 292
358577 358839 348
842747 844169 388
612687 612358 297
810273 809602 344
431700 431055 312
281758 283365 358
984263 984008 352
884741 885879 370
724852 724070 362
869222 869573 388
