...................
----------------------------------------------------------------------
Ran 19 tests in 0.046s

OK
Name             Stmts   Miss Branch BrPart  Cover   Missing
------------------------------------------------------------
Collatz.py          52      0     30      4    95%   48->44, 63->59, 70->85, 77->73
TestCollatz.py      83      0      0      0   100%
------------------------------------------------------------
TOTAL              135      0     30      4    98%