.........
----------------------------------------------------------------------
Ran 9 tests in 0.085s

OK
Name             Stmts   Miss Branch BrPart  Cover   Missing
------------------------------------------------------------
Collatz.py          56      2     22      3    94%   43->45, 75->76, 76, 77->80, 80
TestCollatz.py      60     14      0      0    77%   73-75, 78-80, 92-95, 99-102
------------------------------------------------------------
TOTAL              116     16     22      3    86%
