1 10 20
100 200 125
201 210 89
900 1000 174
999800 999999 259
200 1 125
1 1 1
565146 626437 509
207835 693276 509
203240 157034 370
126542 720485 509
114343 760463 509
983497 88219 525
704752 980688 525
933746 429205 525
280887 877895 525
934323 36834 525
864744 270408 525
977230 817959 525
517351 503269 470
133184 307222 443
74469 423601 449
464891 747589 509
528725 147652 470
791083 350398 509
839391 147108 525
242214 253160 350
959810 242016 525
398521 669365 509
715865 370654 509
988968 564029 525
799129 960612 525
348547 16734 443
163118 359530 443
579520 443636 470
90914 57707 351
5629 34316 311
61312 1600 340
34644 67949 340
90017 72409 351
72232 10640 340
69501 19518 340
68681 82788 351
88715 44170 351
38710 95816 351
53020 47495 340
54860 26673 340
86679 93470 333
21456 76220 340
20570 3495 279
87434 98077 333
60989 74757 330
19951 58221 340
68261 61691 330
46818 99148 351
93952 82427 333
86596 60406 351
97350 6297 351
81727 64827 351
25931 75190 340
97425 85369 333
88026 2790 351
36756 16476 324
97796 78670 338
5916 75386 340
95128 94764 328
56065 85863 351
60643 93655 351
67838 87780 351
74137 762 340
83059 18773 351
81575 88524 333
49455 69442 340
46459 2730 324
20651 31122 308
82919 27595 351
3811 68521 340
41684 90633 351
7467 39183 324
72180 7124 340
73501 52924 335
23342 53456 340
62149 27014 340
22219 17659 279
98152 56580 351
10126 81367 351
27217 7945 308
70917 17165 340
88140 98373 333
13778 15275 271
90862 90914 271
56148 50186 340
39124 21282 324
43640 46768 314
61606 11228 340
742 70424 340
10839 16818 276
82490 13283 351
93160 58070 351
80348 48616 351
49134 87692 351
87829 5295 351
45920 13469 324
73387 36152 340
38360 94770 351
33423 37450 324
90479 47292 351
9815 7390 260
17078 3059 276
33735 46518 324
31205 48930 324
65570 447 340
99604 6339 351
77785 3827 351
61288 66695 330
69879 92389 351
53015 59305 322
75375 99254 351
68298 57515 335
79013 70906 351
87577 88949 333
92211 8579 351
15379 84854 351
27864 91667 351
8523 86747 351
34087 37392 324
20059 410 279
39608 80536 351
65907 5539 340
5304 60451 340
53842 23304 340
58135 47069 340
27686 52527 340
72863 67106 325
