..................
----------------------------------------------------------------------
Ran 18 tests in 0.472s

OK
Name             Stmts   Miss Branch BrPart  Cover   Missing
------------------------------------------------------------
Collatz.py          40      0     16      0   100%
TestCollatz.py      76      0      0      0   100%
cache.py             1      0      0      0   100%
------------------------------------------------------------
TOTAL              117      0     16      0   100%
