1 10 20
100 200 125
201 210 89
900 1000 174
87 112 119
89 187 125
116 161 122
42 66 113
119 205 125
49 97 119
161 186 125
140 156 117
177 256 128
5 98 119
58 76 116
178 238 128
170 195 125
146 242 128
156 164 112
38 112 119
154 191 125
44 97 119
27 114 119
13 91 116
148 203 125
126 207 125
2 27 112
41 96 116
25 33 112
45 125 119
43 116 119
42 46 30
118 127 109
174 185 94
79 164 122
120 204 125
30 73 116
91 161 122
59 88 116
81 84 111
185 255 128
167 200 125
89 141 122
39 93 116
18 100 119
82 101 119
154 244 128
62 132 122
98 181 125
128 143 122
117 176 125
10 50 112
163 178 125
59 98 119
52 152 122
81 91 111
17 37 112
186 214 120
6 71 113
197 243 128
78 116 119
149 222 125
141 208 125
128 174 125
151 242 128
63 77 116
69 73 116
12 98 119
4 88 116
46 95 116
184 240 128
57 107 119
82 94 111
181 256 128
122 144 122
167 224 125
139 149 117
111 151 122
187 258 128
67 149 122
166 251 128
142 174 125
198 240 128
88 91 93
154 176 125
86 174 125
98 186 125
35 37 22
28 44 110
178 263 128
111 200 125
173 220 120
75 140 122
61 115 119
116 132 122
75 87 111
141 185 125
159 216 125
123 145 122
99 125 114
171 246 128
116 196 125
72 170 122
80 107 119
52 78 116
155 209 125
166 173 125
153 204 125
28 44 110
129 142 122
185 221 120
145 211 125
1 4 8
113 152 122
4 38 112
163 190 125
106 149 122
130 151 117
181 236 128
85 147 122
142 151 117
6 64 113
147 216 125
4 99 119
153 252 128
56 137 122
154 238 128
66 104 119
24 41 112
98 115 114
19 51 112
141 233 128
173 251 128
167 233 128
167 250 128
33 117 119
3 53 112
100 178 125
31 96 116
35 133 122
101 173 125
36 61 113
198 273 128
57 140 122
45 125 119
114 154 122
152 152 24
33 93 116
153 207 125
60 105 119
113 194 125
9 54 113
83 111 119
128 133 122
35 114 119
58 117 119
33 68 113
60 96 116
134 136 42
121 148 122
17 97 119
193 218 120
8 106 119
113 185 125
172 212 120
70 165 122
3 33 112
56 81 116
152 190 125
77 153 122
117 173 125
43 84 116
189 221 120
118 120 34
159 232 128
175 252 128
184 205 120
96 186 125
52 56 113
128 173 125
115 122 96
44 134 122
153 158 86
22 37 112
58 60 33
108 126 114
92 157 122
31 80 116
54 115 119
24 117 119
9 9 20
84 140 122
197 259 128
185 245 128
1 50 112
110 146 122
124 184 125
26 98 119
187 188 107
42 109 119
