1 10 20
100 200 125
201 210 89
900 1000 174
12 15 18
5 5 6
2 2 2
10 1 20
15 12 18
1000 1002 143
30 25 112
3 7 17
95 90 106
1 1 1
500 1 144
15 16 18
16 15 18
69 79 116
665 664 114
102 100 26
105 100 88
150 155 86
1 209 125
250 275 123
300 305 43
305 300 43
300 300 17
207 210 89
212 211 40
273 277 92
277 267 92
289 289 30
315 310 131
219 226 115
9 10 20
10 9 20
37 39 35
39 37 35
32 32 6
3005 3009 155
3009 3009 41
182 182 94
182 181 94
181 182 94
4 7 17
9 11 20
11 9 20
27 97 119
97 27 119
97 97 119
9 1 20
1 9 20
8 8 4
12 21 21
36 63 113
63 63 108
994 996 50
87 108 119
98 103 88
103 98 88
177 201 120
201 177 120
177 177 32
10 13 15
13 10 15
13 13 10
10 14 18
14 10 18
14 14 18
498 502 111
502 498 111
123 129 122
129 123 122
987 300 179
987 900 174
900 900 55
256 257 123
257 256 123
987 981 143
981 981 24
2 14 20
14 2 20
14 14 18
160 168 112
168 160 112
27 35 112
35 27 112
654 666 145
666 654 145
666 666 114
2019 2020 113
2020 2019 113
411 416 134
416 416 15
11 19 21
90 99 119
99 99 26
1000 1000 112
5000 5000 29
2 5 8
82 182 125
82 187 125
