Name             Stmts   Miss  Cover   Missing
----------------------------------------------
Collatz.py          45      2    96%   15, 122
TestCollatz.py      63      4    94%   37-40
----------------------------------------------
TOTAL              108      6    94%
