1 100 119
1000 5000 238
4001 5000 215
5 5 6
1000 1001 143
100000 21 351
100 1 119
32165 54987 340
15926 48723 324
12000 14000 276
200 3000 217
300 400 144
199000 20000 383
1700 1892 180
1999 2019 144
53 25 112
1716 1252 180
30 46 110
1 999999 525
10 999999 525
100 999899 525
200 899899 525
2000 3000 217
3111 4111 238
1 1000 179
2002 3000 217
4000 5000 215
10000 30125 308
12456 900000 525
999999 1 525
999999 999999 259
643459 538519 509
347392 554500 470
542003 714669 509
291907 848135 525
678759 780114 504
521741 739648 509
728595 233275 509
157899 4854 383
829664 442396 509
377504 804964 509
69089 39967 340
966279 881492 507
19562 606687 470
917743 656603 525
930696 47379 525
361438 338694 441
436549 81121 449
434618 865540 525
718402 701793 504
760092 214046 509
798286 542042 509
718365 837613 468
660719 151231 509
102691 492633 449
955490 768346 525
522816 325477 470
733742 879941 525
123099 43298 354
948870 746781 525
568993 95898 470
790168 897012 525
81925 537817 470
934483 416744 525
249314 102270 443
867274 755498 525
557302 733569 509
793108 122244 509
698632 273907 509
456040 833407 509
540207 727330 509
156532 9381 383
184771 203155 360
56548 703422 509
494196 587334 470
119313 354600 443
85668 389797 443
692589 607267 509
533727 554793 452
480792 865572 525
582177 671965 509
222876 936980 525
129357 428885 449
718266 910291 525
975435 787323 525
239055 541292 470
68263 197640 383
912374 36778 525
982394 966823 458
296153 73662 443
101719 537967 470
180621 780603 509
593538 35201 470
312335 551771 470
964906 126572 525
705069 879990 525
419855 864747 525
630278 807944 504
223167 273651 443
290447 175927 443
103206 730738 509
402280 165681 443
812275 583240 509
835379 220369 509
421755 135818 449
950004 416615 525
648659 529665 509
637075 381145 509
321988 494630 449
178807 557572 470
772290 981574 525
525541 882063 525
861283 996323 507
340881 592172 470
254767 422262 449
890418 766381 525
618760 350284 470
5922 878744 525
632003 992592 525
700549 988449 525
344880 908693 525
501307 296280 449
459694 483848 444
388560 217345 443
962626 755941 525
382610 695024 509
800131 834550 450
541693 505293 470
299 68892 340
995972 732254 525
611725 689268 509
322023 41038 443
844722 379086 525
759991 711159 424
536626 146043 470
416354 260698 449
710651 437747 509
600991 462420 470
431086 977650 525
275929 244550 407
49867 933316 525
629349 300125 509
335852 21940 443
697866 689003 442
965822 920390 507
478663 717655 509
558977 873572 525
415721 63767 449
462235 63476 449
656256 382964 509
403978 379230 436
657167 465975 509
627010 763650 504
435552 197773 449
978878 631459 525
48845 804711 509
294679 516923 470
475237 584599 470
324502 785731 509
785958 935382 525
982872 724027 525
166303 841618 525
210245 939485 525
714276 443924 509
202443 15938 383
60508 302848 443
337474 882926 525
973540 421887 525
997371 152392 525
455169 936417 525
996802 676421 525
926692 136467 525
268455 40569 443
379619 490035 449
29357 92894 351
995821 314599 525
312623 507120 449
934510 860325 476
744718 993739 525
740419 778692 468
786191 806424 468
945866 682166 525
552706 707854 509
651141 487612 509
896318 461276 525
123502 885644 525
605460 205817 470
557767 207497 470
224714 178144 386
709223 426302 509
758158 742958 424
678855 794493 504
95965 291918 443
702192 981950 525
601765 554547 434
924612 356662 525
41867 617924 470
470356 849704 525
436026 200731 449
813959 262210 509
5125 235481 443
691464 464143 509
802048 239894 509
72546 461313 449
325396 692858 509
626398 337611 509
136632 184210 383
566940 850919 525
413207 431834 418
928415 316880 525
902064 982468 507
791905 255119 509
199155 830675 509
844727 620596 525
