[
    [
        [3, 3],
        [3, 4],
        [3, 5],
        [3, 6],
        [3, 7]
    ],
    [
        [1, 2],
        [1, 3],
        [1, 4],
        [1, 5],
        [2, 4],
        [3, 4],
        [4, 4]
    ],
    [
        [0, 1],
        [0, 2],
        [0, 3],
        [0, 4],
        [0, 5],
        [0, 6],
        [1, 2],
        [2, 2],
        [3, 2],
        [3, 3],
        [3, 4],
        [3, 5],
        [3, 6]
    ],
    [
        [1, 1],
        [1, 2], 
        [1, 3],
        [1, 4],
        [1, 5],
        [1, 6],
        [1, 7],
        [1, 8],
        [2, 1],
        [3, 1],
        [4, 1],
        [5, 1],
        [6, 1],
        [7, 1],
        [8, 1],
        [2, 7],
        [3, 7],
        [4, 7],
        [6, 2],
        [6, 3],
        [6, 4],
        [6, 5], 
        [6, 6],
        [8, 2],
        [8, 3],
        [8, 4],
        [8, 5],
        [8, 6],
        [8, 7]
    ],
    [
        [0, 5],
        [1, 1],
        [1, 2],
        [1, 3],
        [1, 4],
        [1, 5],
        [1, 6],
        [1, 7],
        [2, 1],
        [2, 7],
        [3, 1],
        [3, 7],
        [4, 1],
        [4, 7],
        [5, 1],
        [5, 7],
        [6, 1],
        [6, 7],
        [7, 1],
        [7, 2],
        [7, 3],
        [7, 4],
        [7, 5],
        [7, 6]
    ],
    [
        [0, 3],
        [0, 4],
        [1, 3],
        [2, 1],

        [2, 1],
        [2, 2],
        [2, 3],
        [2, 4],
        [2, 5],
        [2, 6],

        [3, 1],
        [3, 4],
        [3, 5],
        [3, 6],

        [4, 0],
        [4, 1],
        [4, 3],
        [4, 4],
        [4, 6],
        [4, 7],
        [4, 8],

        [5, 0],
        [5, 1],
        [5, 3],
        [5, 6],
        [5, 7],

        [6, 2],
        [6, 3],
        [6, 4],
        [6, 5],
        
        [7, 0],
        [7, 1],
        [7, 2],
        [7, 4],
        [7, 5],
        [7, 6],
        [7, 7],

        [8, 1],
        [8, 4],
        [8, 6]
    ],
    [
        [0, 5],
        [0, 6],

        [1, 4],
        [1, 5],
        [1, 6],

        [2, 2],
        [2, 3],
        [2, 4],

        [3, 1],
        [3, 2],
        [3, 4],
        [3, 5],
        [3, 6],

        [4, 1],

        [5, 1],
        [5, 2],
        [5, 3],

        [6, 2],
        [6, 3],
        [6, 4],
        
        [7, 2],
        [7, 4],
        [7, 5],
        [7, 6],
        [7, 7],

        [8, 5]
    ],
    [
        [0, 4],

        [1, 3],
        [1, 4],
        [1, 5],

        [2, 5],
        [2, 6],
        [2, 7],

        [3, 2],
        [3, 3],
        [3, 4],
        [3, 5],
        [3, 7],

        [4, 0],
        [4, 1],
        [4, 2],
        [4, 4],

        [5, 0],
        [5, 4],
        [5, 5],
        [5, 6],

        [6, 0],
        [6, 1],
        [6, 2],
        [6, 5],
        [6, 6],
        [6, 7],
        [6, 8],

        [7, 1],
        [7, 2],
        [7, 3],
        [7, 6],
        [7, 8],

        [8, 1],
        [8, 3],
        [8, 6]
    ],
    [
        [0, 1],
        [0, 2],
        [0, 3],
        [0, 4],

        [1, 1],
        [1, 3],
        [1, 4],
        [1, 5],

        [2, 0],
        [2, 1],
        [2, 2],
        [2, 4],

        [3, 0],
        [3, 4],
        [3, 5],
        [3, 6],
        [3, 7],

        [4, 2],
        [4, 3],
        [4, 4],
        [4, 6],

        [5, 1],
        [5, 2],
        [5, 3],
        [5, 6],
        [5, 7],
        [5, 8],

        [6, 1],
        [6, 3],
        [6, 4],
        [6, 7],

        [7, 0],
        [7, 1],
        [7, 2],
        [7, 4],
        [7, 5],
        
        [8, 2],
        [8, 5],
        [8, 6],
        [8, 7]
    ],
    
    [
        [0, 6],
        [0, 7],
        [0, 8],

        [1, 5],
        [1, 6],
        [1, 7],

        [2, 3],
        [2, 4],
        [2, 5],
        [2, 7],
        [2, 8],

        [3, 3],
        [3, 4],
        [3, 8],

        [4, 1],
        [4, 2],
        [4, 3],
        [4, 6],
        [4, 7],
        [4, 8],

        [5, 0],
        [5, 1],
        [5, 3],
        [5, 4],
        [5, 5],
        [5, 7],

        [6, 0],
        [6, 2],
        [6, 3],
        [6, 4],
        [6, 6],
        [6, 7],
        [6, 8],

        [7, 0],
        [7, 2],
        [7, 4],
        [7, 5],
        [7, 7],
        [7, 8],

        [8, 1],
        [8, 2],
        [8, 3],
        [8, 8]
    ],
    [
        [0, 1],
        [0, 2],
        [0, 3],
        [0, 4],

        [1, 2],
        [1, 3],

        [2, 3],
        [2, 4],
        [2, 5],
        [2, 6],

        [3, 3],
        [3, 5],
        [3, 6],
        [3, 7],

        [4, 2],
        [4, 3],
        [4, 4],
        [4, 7],
        [4, 8],

        [5, 0],
        [5, 1],
        [5, 2],
        [5, 4],
        [5, 5],
        [5, 6],
        [5, 8],

        [6, 0],
        [6, 2],
        [6, 5],
        [6, 8],

        [7, 0],
        [7, 3],
        [7, 4],
        [7, 5],

        [8, 3],
        [8, 4]
    ],
    [
        [0, 3],
        [0, 4],
        [0, 5],
        [0, 6],

        [1, 3],
        [1, 4],
        [1, 7],
        [1, 8],

        [2, 4],
        [2, 5],
        [2, 6],

        [3, 5],
        [3, 6],

        [4, 3],
        [4, 4],
        [4, 5],
        [4, 6],
        [4, 7],

        [5, 1],
        [5, 2],
        [5, 3],
        [5, 4],
        [5, 7],

        [6, 0],
        [6, 1],
        [6, 2],
        [6, 4],
        [6, 6],
        [6, 7],
        [6, 8],

        [7, 0],
        [7, 2],
        [7, 4],
        [7, 5],
        [7, 8],

        [8, 0],
        [8, 5],
        [8, 6],
        [8, 7]
    ]
]