<svg xmlns="http://www.w3.org/2000/svg" width="1488" height="1001" viewBox="0 0 1488 1001">
  <defs>
    <style>
      .cls-1 {
        fill: none;
      }

      .cls-2 {
        fill: #0b6e4f;
      }

      .cls-3 {
        fill: #58b65a;
      }

      .cls-4 {
        fill: #7fb069;
      }

      .cls-5 {
        fill: #86daf1;
      }

      .cls-6 {
        fill: #b5d653;
      }

      .cls-7 {
        fill: #79c258;
      }

      .cls-8 {
        fill: #c3ea21;
      }

      .cls-9 {
        fill: #8adb53;
      }

      .cls-10 {
        fill: #ba7400;
      }

      .cls-11 {
        fill: #4fc16e;
      }

      .cls-12 {
        fill: #369151;
      }

      .cls-13 {
        fill: #804d00;
      }

      .cls-14 {
        fill: #019961;
      }

      .cls-15 {
        fill: #3dad5c;
      }
    </style>
  </defs>
  <g id="Group_181" data-name="Group 181" transform="translate(76)">
    <rect id="Rectangle_71" data-name="Rectangle 71" class="cls-1" width="1366" height="1001"/>
    <ellipse id="Ellipse_100" data-name="Ellipse 100" class="cls-2" cx="89.5" cy="81" rx="89.5" ry="81" transform="translate(1233 118)"/>
    <ellipse id="Ellipse_106" data-name="Ellipse 106" class="cls-3" cx="53.5" cy="48" rx="53.5" ry="48" transform="translate(-53 221)"/>
    <g id="Group_161" data-name="Group 161" transform="translate(408.5 -40)">
      <g id="worldwide" transform="translate(279 317)">
        <g id="Group_160" data-name="Group 160" transform="translate(21.011 17.875)">
          <path id="Path_413" data-name="Path 413" class="cls-4" d="M450.108,77.639,422.167,94.664,375.6,86.152l-27.941-8.513-37.254,8.513-27.941-8.513,18.626-34.051h37.254L374.854,26.9A266.694,266.694,0,0,1,450.108,77.639Z" transform="translate(-5.486 -18.9)"/>
          <path id="Path_414" data-name="Path 414" class="cls-4" d="M250.329,43.291,241.016,68.83l-27.941,8.513-27.941,42.564-46.567,25.539-65.193,8.513V179.5L92,196.522v34.051L64.062,213.547,36.121,196.522,19.916,152C47.809,91.244,101.129,43.214,168,18.6l26.45,16.175Z" transform="translate(-19.916 -18.604)"/>
          <path id="Path_415" data-name="Path 415" class="cls-4" d="M266.171,288.556l-9.313,42.564L219.6,365.172V390.71L182.35,416.248v42.564l-27.94-8.513-18.627-42.564V322.608L89.216,314.1,70.59,280.044V254.5L89.216,237.48l27.941-25.539,18.626,34.051h65.193l27.941,42.564Z" transform="translate(-17.131 -25.511)"/>
          <path id="Path_416" data-name="Path 416" class="cls-4" d="M490.64,130.41c50.842,82.906,45.049,185.137-14.9,262.79l-25.146-22.984V336.163l-18.626-34.051L413.34,268.061V234.009L385.4,216.984,348.146,225.5l-65.193-25.539-9.313-59.589L301.58,114.83h55.88l18.626,25.539,55.88,8.513,55.88-17.025Z" transform="translate(-5.971 -22.042)"/>
        </g>
        <path id="Path_417" data-name="Path 417" class="cls-5" d="M325.931,85.193l37.254-8.513,27.941,8.513,46.567,8.513L465.633,76.68A245.778,245.778,0,0,1,505.68,126.31l-2.794,1.447-55.88,17.025-55.88-8.513L372.5,110.731H316.62L288.679,136.27l9.313,59.589L363.186,221.4l37.254-8.513L428.38,229.91v34.051l18.626,34.051,18.626,34.051v34.051L490.779,389.1c-86.009,111.4-254.536,137.967-376.4,59.351C10.878,381.676-27.95,258.13,21.011,151.337l16.205,44.521,27.941,17.025L93.1,229.909,74.47,246.935v25.539L93.1,306.525l46.567,8.513v85.128l18.626,42.564,27.941,8.513V408.679l37.254-25.539V357.6l37.254-34.051,9.313-42.564H232.8l-27.941-42.564H139.663L121.037,204.37,93.1,229.909V195.858L74.47,178.834V153.295l65.193-8.513,46.567-25.539,27.941-42.564,27.941-8.513,9.313-25.539-55.88-8.513-26.45-16.175c71.62-26.364,152.162-23.453,221.286,8L353.872,42.628H316.618L297.991,76.679Z" transform="translate(0 -0.067)"/>
      </g>
    </g>
    <ellipse id="Ellipse_112" data-name="Ellipse 112" class="cls-3" cx="66" cy="66.5" rx="66" ry="66.5" transform="translate(434 514)"/>
    <ellipse id="Ellipse_113" data-name="Ellipse 113" class="cls-6" cx="35.5" cy="32" rx="35.5" ry="32" transform="translate(357 498)"/>
    <ellipse id="Ellipse_114" data-name="Ellipse 114" class="cls-6" cx="36" cy="32.5" rx="36" ry="32.5" transform="translate(1277 294)"/>
    <ellipse id="Ellipse_115" data-name="Ellipse 115" class="cls-7" cx="25.5" cy="23" rx="25.5" ry="23" transform="translate(368 575)"/>
    <g id="forest" transform="translate(55.924 416)">
      <path id="Path_418" data-name="Path 418" class="cls-8" d="M198.061,112.334a25.736,25.736,0,0,0-51.321,0A25.737,25.737,0,1,0,172.4,155.892a25.736,25.736,0,1,0,25.661-43.558Z" transform="translate(-96.361 -68.501)"/>
      <path id="Path_419" data-name="Path 419" class="cls-9" d="M343.955,112.334a25.737,25.737,0,0,0-25.661-23.767v67.325a25.736,25.736,0,1,0,25.661-43.558Z" transform="translate(-242.255 -68.501)"/>
      <path id="Path_420" data-name="Path 420" class="cls-10" d="M280.768,226.274l-3.163-6.016-8.984,4.724v-9.931h-6.8v22.262l-8.985-4.724-3.163,6.016,12.148,6.387v37.336h6.8V232.661Z" transform="translate(-189.183 -166.329)"/>
      <path id="Path_421" data-name="Path 421" class="cls-11" d="M30.682,84.433h0A25.6,25.6,0,0,1,5.268,55.727l4.55-37.256A21.019,21.019,0,0,1,30.682,0h0A21.019,21.019,0,0,1,51.546,18.471L56.1,55.727A25.6,25.6,0,0,1,30.682,84.433Z" transform="translate(0)"/>
      <path id="Path_422" data-name="Path 422" class="cls-12" d="M118.1,84.433h0V0h0A21.019,21.019,0,0,1,138.96,18.471l4.55,37.256A25.6,25.6,0,0,1,118.1,84.433Z" transform="translate(-87.414)"/>
      <path id="Path_423" data-name="Path 423" class="cls-13" d="M77.408,141.677,68.423,146.4V129.137l12.148-6.387-3.163-6.016-8.985,4.724v-9.931h-6.8v22.4l-8.984-4.724-3.163,6.016,12.148,6.387v60.651h6.8V154.08l12.148-6.387Z" transform="translate(-34.343 -86.259)"/>
    </g>
    <ellipse id="Ellipse_116" data-name="Ellipse 116" class="cls-14" cx="194" cy="175.5" rx="194" ry="175.5" transform="translate(-76 524)"/>
    <ellipse id="Ellipse_117" data-name="Ellipse 117" class="cls-7" cx="69" cy="62.5" rx="69" ry="62.5" transform="translate(1258 750)"/>
    <ellipse id="Ellipse_118" data-name="Ellipse 118" class="cls-4" cx="21" cy="19" rx="21" ry="19" transform="translate(1258 710)"/>
    <ellipse id="Ellipse_119" data-name="Ellipse 119" class="cls-6" cx="21" cy="19" rx="21" ry="19" transform="translate(1216 748)"/>
    <ellipse id="Ellipse_120" data-name="Ellipse 120" class="cls-15" cx="21" cy="19" rx="21" ry="19" transform="translate(1195 691)"/>
  </g>
</svg>
