<svg xmlns="http://www.w3.org/2000/svg" xmlns:xlink="http://www.w3.org/1999/xlink" width="589.581" height="356.613" viewBox="0 0 589.581 356.613">
  <defs>
    <style>
      .cls-1 {
        fill: url(#linear-gradient);
      }

      .cls-2 {
        fill: url(#linear-gradient-2);
      }

      .cls-3 {
        fill: url(#linear-gradient-3);
      }

      .cls-4 {
        fill: url(#linear-gradient-4);
      }

      .cls-5 {
        fill: url(#linear-gradient-5);
      }

      .cls-6 {
        fill: url(#linear-gradient-6);
      }

      .cls-7 {
        fill: url(#linear-gradient-7);
      }

      .cls-8 {
        fill: url(#linear-gradient-8);
      }

      .cls-9 {
        fill: #fff;
      }

      .cls-10 {
        fill: #5fcd59;
      }

      .cls-11 {
        fill: #44b747;
      }

      .cls-12 {
        fill: #9dea59;
      }

      .cls-13 {
        fill: url(#linear-gradient-9);
      }

      .cls-14 {
        fill: #e6f3de;
      }
    </style>
    <linearGradient id="linear-gradient" x1="0.967" y1="0.5" x2="0.023" y2="0.5" gradientUnits="objectBoundingBox">
      <stop offset="0" stop-color="#b5d653"/>
      <stop offset="0.995" stop-color="#019961"/>
    </linearGradient>
    <linearGradient id="linear-gradient-2" y1="0.5" x2="1" y2="0.5" gradientUnits="objectBoundingBox">
      <stop offset="0" stop-color="#929292"/>
      <stop offset="0.014" stop-color="#c1c1c1"/>
      <stop offset="0.027" stop-color="#b1b1b1"/>
      <stop offset="0.049" stop-color="#9c9c9c"/>
      <stop offset="0.071" stop-color="#a3a3a3"/>
      <stop offset="0.091" stop-color="#afafaf"/>
      <stop offset="1" stop-color="#cfcfcf"/>
    </linearGradient>
    <linearGradient id="linear-gradient-3" y1="0.5" x2="1" y2="0.5" gradientUnits="objectBoundingBox">
      <stop offset="0.005" stop-color="#f8f8f8"/>
      <stop offset="0.064" stop-color="#d0d0d0"/>
      <stop offset="0.503" stop-color="#f8f8f8"/>
      <stop offset="0.866" stop-color="#d0d0d0"/>
      <stop offset="0.876" stop-color="#d3d3d3"/>
      <stop offset="0.951" stop-color="#e8e8e8"/>
      <stop offset="1" stop-color="#f1f1f1"/>
    </linearGradient>
    <linearGradient id="linear-gradient-4" y1="0.5" x2="1" y2="0.5" gradientUnits="objectBoundingBox">
      <stop offset="0" stop-color="#cfcfcf"/>
      <stop offset="0.909" stop-color="#afafaf"/>
      <stop offset="0.929" stop-color="#a3a3a3"/>
      <stop offset="0.951" stop-color="#9c9c9c"/>
      <stop offset="0.973" stop-color="#b1b1b1"/>
      <stop offset="0.986" stop-color="#c1c1c1"/>
      <stop offset="1" stop-color="#929292"/>
    </linearGradient>
    <linearGradient id="linear-gradient-5" y1="0.5" x2="1" y2="0.5" gradientUnits="objectBoundingBox">
      <stop offset="0" stop-color="#666"/>
      <stop offset="0.014" stop-color="#d5d5d5"/>
      <stop offset="0.021" stop-color="#bdbdbd"/>
      <stop offset="0.04" stop-color="#858585"/>
      <stop offset="0.049" stop-color="#707070"/>
      <stop offset="0.057" stop-color="#787878"/>
      <stop offset="0.07" stop-color="#8d8d8d"/>
      <stop offset="0.087" stop-color="#b1b1b1"/>
      <stop offset="0.091" stop-color="#bcbcbc"/>
      <stop offset="1" stop-color="#f1f1f1"/>
    </linearGradient>
    <linearGradient id="linear-gradient-6" y1="0.5" x2="1" y2="0.5" gradientUnits="objectBoundingBox">
      <stop offset="0" stop-color="#f1f1f1"/>
      <stop offset="0.909" stop-color="#bcbcbc"/>
      <stop offset="0.913" stop-color="#b1b1b1"/>
      <stop offset="0.93" stop-color="#8d8d8d"/>
      <stop offset="0.943" stop-color="#787878"/>
      <stop offset="0.951" stop-color="#707070"/>
      <stop offset="0.96" stop-color="#858585"/>
      <stop offset="0.979" stop-color="#bdbdbd"/>
      <stop offset="0.986" stop-color="#d5d5d5"/>
      <stop offset="1" stop-color="#666"/>
    </linearGradient>
    <linearGradient id="linear-gradient-7" y1="0.5" x2="1" y2="0.5" gradientUnits="objectBoundingBox">
      <stop offset="0" stop-color="#9f9f9f"/>
      <stop offset="0.04" stop-color="#acacac"/>
      <stop offset="0.514" stop-color="#e5e5e5"/>
      <stop offset="0.963" stop-color="#acacac"/>
      <stop offset="1" stop-color="#9f9f9f"/>
    </linearGradient>
    <linearGradient id="linear-gradient-8" x1="0.5" y1="1" x2="0.5" gradientUnits="objectBoundingBox">
      <stop offset="0" stop-color="#575757"/>
      <stop offset="0.739" stop-color="#b9b9b9"/>
      <stop offset="0.847" stop-color="#b5b5b5"/>
      <stop offset="0.936" stop-color="#ababab"/>
      <stop offset="1" stop-color="#9f9f9f"/>
    </linearGradient>
    <linearGradient id="linear-gradient-9" x1="0.099" y1="0.372" x2="0.834" y2="1.558" gradientUnits="objectBoundingBox">
      <stop offset="0" stop-color="#8dc957"/>
      <stop offset="1" stop-color="#31a95d"/>
    </linearGradient>
  </defs>
  <g id="Group_151" data-name="Group 151" transform="translate(289.274 -2966.83)">
    <path id="Path_74" data-name="Path 74" class="cls-1" d="M-175.892,0H240.192a125.061,125.061,0,1,1,0,250.122H-175.892c-69.069,0-44-55.992-44-125.061S-244.962,0-175.892,0Z" transform="translate(-64.946 3017.38)"/>
    <g id="Group_40" data-name="Group 40" transform="translate(-95.938 3110.717)">
      <g id="Group_39" data-name="Group 39" transform="translate(0 0)">
        <g id="Group_34" data-name="Group 34" transform="translate(37.283)">
          <g id="Group_33" data-name="Group 33">
            <rect id="Rectangle_9" data-name="Rectangle 9" width="303.03" height="5.377" transform="translate(1.332 195.834)"/>
            <path id="Path_70" data-name="Path 70" d="M-667.849,443.311V631.245h-303.03V443.311a7.942,7.942,0,0,1,7.965-7.9h287.1A7.942,7.942,0,0,1-667.849,443.311Z" transform="translate(972.211 -435.411)"/>
            <path id="Path_71" data-name="Path 71" d="M-668.034,868.585v.492h-1.349v0h-303.03v0h-1.332v-.492Z" transform="translate(973.746 -667.375)"/>
          </g>
        </g>
        <g id="Group_38" data-name="Group 38" transform="translate(0 201.403)">
          <g id="Group_37" data-name="Group 37">
            <g id="Group_35" data-name="Group 35" transform="translate(0 0.299)">
              <rect id="Rectangle_10" data-name="Rectangle 10" class="cls-2" width="188.6" height="5.709" transform="translate(0 0.285)"/>
              <rect id="Rectangle_11" data-name="Rectangle 11" class="cls-3" width="377.2" height="0.285"/>
              <rect id="Rectangle_12" data-name="Rectangle 12" class="cls-4" width="188.6" height="5.709" transform="translate(188.6 0.285)"/>
            </g>
            <g id="Group_36" data-name="Group 36" transform="translate(0 0.584)">
              <rect id="Rectangle_13" data-name="Rectangle 13" class="cls-5" width="188.6" height="5.371"/>
              <rect id="Rectangle_14" data-name="Rectangle 14" class="cls-6" width="188.6" height="5.371" transform="translate(188.6)"/>
            </g>
            <path id="Path_72" data-name="Path 72" class="cls-7" d="M-652.087,869.647a4.345,4.345,0,0,1-1.281,3.09,4.353,4.353,0,0,1-3.09,1.281h-44.949a4.371,4.371,0,0,1-4.368-4.371Z" transform="translate(867.531 -869.346)"/>
            <image id="Rectangle_15" data-name="Rectangle 15" width="54.811" height="5.11" transform="translate(161.187)" xlink:href="data:image/png;base64,iVBORw0KGgoAAAANSUhEUgAAAHYAAAALCAYAAACqG3kOAAAAAXNSR0IArs4c6QAAAARnQU1BAACxjwv8YQUAAADTSURBVFhH7ZjLCoMwEEWNKz+mtKX0//eFUlrbfzG79N5pJsRHF4LQJswBuZMxinKIim4YhlcDuq7bMY2y8d73iLb9DI3aMLGVYmIrpdV3K57N8q41ygUOH0w6tRVbKSI2W7VPplEecHePpTBbsSa3PODsFksu0j3ThRCkQTKp0tRJxn8CX1eEixu/l47sk5FYEuXmTZV8kJHxU+DnglCZaYOfEzIxE6vgBPyDQWaSI0v16rnO8brWHxfZYu5WyI18YbovH2u9lNNafaUxhJ7ZGNM0bxIiVi7DfGKrAAAAAElFTkSuQmCC"/>
          </g>
          <path id="Path_73" data-name="Path 73" class="cls-8" d="M-1054.009,882.546a168.3,168.3,0,0,0,40.966,5.031h295.267a168.306,168.306,0,0,0,40.966-5.031h-377.2Z" transform="translate(1054.009 -876.254)"/>
        </g>
      </g>
      <rect id="Rectangle_16" data-name="Rectangle 16" class="cls-9" width="290.491" height="179.738" transform="translate(44.883 11.448)"/>
    </g>
    <g id="Group_56" data-name="Group 56" transform="matrix(-0.951, -0.309, 0.309, -0.951, 244.362, 3372)">
      <g id="Group_55" data-name="Group 55" transform="translate(0 0)">
        <path id="Path_78" data-name="Path 78" class="cls-10" d="M25.483,23C14.8,31.329,0,30.2,0,30.2S2.523,15.574,13.209,7.249,38.694.051,38.694.051,36.169,14.678,25.483,23Z" transform="translate(267.088 218.741)"/>
        <path id="Path_86" data-name="Path 86" class="cls-10" d="M25.483,23C14.8,31.329,0,30.2,0,30.2S2.523,15.575,13.209,7.249,38.694.051,38.694.051,36.169,14.678,25.483,23Z" transform="matrix(0.695, -0.719, 0.719, 0.695, 91.957, 283.284)"/>
        <path id="Path_79" data-name="Path 79" class="cls-11" d="M12.745,15.641C12.762,24.287,6.4,31.307,6.4,31.307s-6.386-7-6.4-15.642S6.342,0,6.342,0,12.728,7,12.745,15.641Z" transform="translate(359.289 273.833)"/>
        <path id="Path_85" data-name="Path 85" class="cls-11" d="M12.745,15.641C12.762,24.287,6.4,31.307,6.4,31.307s-6.386-7-6.4-15.642S6.342,0,6.342,0,12.728,7,12.745,15.641Z" transform="translate(33.607 158.288) rotate(106)"/>
        <path id="Path_80" data-name="Path 80" class="cls-12" d="M17.462,15.577C7.106,13.828,0,4.776,0,4.776S9.686-1.44,20.041.311s17.46,10.8,17.46,10.8S27.818,17.327,17.462,15.577Z" transform="translate(201.814 252.284)"/>
        <path id="Path_88" data-name="Path 88" class="cls-12" d="M17.462,15.577C7.106,13.828,0,4.776,0,4.776S9.686-1.44,20.041.311s17.46,10.8,17.46,10.8S27.818,17.327,17.462,15.577Z" transform="translate(373.063 85.493) rotate(-34)"/>
        <path id="Path_84" data-name="Path 84" class="cls-12" d="M17.462,15.577C7.106,13.828,0,4.776,0,4.776S9.686-1.44,20.041.311s17.46,10.8,17.46,10.8S27.818,17.327,17.462,15.577Z" transform="matrix(-0.53, 0.848, -0.848, -0.53, 374.976, 8.419)"/>
        <path id="Path_83" data-name="Path 83" class="cls-12" d="M17.462,15.577C7.106,13.828,0,4.776,0,4.776S9.686-1.44,20.041.311s17.46,10.8,17.46,10.8S27.818,17.327,17.462,15.577Z" transform="translate(398.415 147.867)"/>
        <path id="Path_81" data-name="Path 81" class="cls-12" d="M10.229,12.926c-2.7,6.039-9.34,8.943-9.34,8.943s-2.264-6.885.436-12.924S10.665,0,10.665,0,12.927,6.887,10.229,12.926Z" transform="translate(226.195 309.209)"/>
        <path id="Path_87" data-name="Path 87" class="cls-12" d="M10.229,12.926c-2.7,6.039-9.34,8.943-9.34,8.943s-2.264-6.885.436-12.924S10.665,0,10.665,0,12.927,6.887,10.229,12.926Z" transform="translate(367.428 208.435) rotate(-68)"/>
        <path id="Path_82" data-name="Path 82" class="cls-10" d="M12.924,10.23C6.887,12.934,0,10.677,0,10.677S2.9,4.034,8.937,1.329,21.862.884,21.862.884,18.961,7.525,12.924,10.23Z" transform="translate(90.963 347.07)"/>
      </g>
    </g>
    <rect id="Rectangle_22" data-name="Rectangle 22" class="cls-13" width="290.779" height="28.335" transform="translate(-51.321 3121.4)"/>
    <rect id="Rectangle_23" data-name="Rectangle 23" class="cls-9" width="152.821" height="12.077" rx="6.039" transform="translate(-24.845 3129.761)"/>
    <rect id="Rectangle_29" data-name="Rectangle 29" class="cls-9" width="32.051" height="12.077" rx="6.039" transform="translate(138.196 3129.761)"/>
    <rect id="Rectangle_24" data-name="Rectangle 24" class="cls-14" width="111.016" height="79.894" transform="translate(-24.845 3176.676)"/>
    <rect id="Rectangle_25" data-name="Rectangle 25" class="cls-14" width="111.016" height="10.684" transform="translate(105.216 3177.141)"/>
    <rect id="Rectangle_26" data-name="Rectangle 26" class="cls-14" width="72.927" height="10.684" transform="translate(105.216 3198.043)"/>
    <rect id="Rectangle_27" data-name="Rectangle 27" class="cls-14" width="111.016" height="10.684" transform="translate(105.216 3218.946)"/>
    <rect id="Rectangle_28" data-name="Rectangle 28" class="cls-14" width="65.03" height="10.684" transform="translate(105.216 3239.848)"/>
  </g>
</svg>
