<svg xmlns="http://www.w3.org/2000/svg" viewBox="0 0 317.48 70.53">
  <defs>
    <style>
      .cls-1 {
        fill: #fff;
      }
    </style>
  </defs>
  <g id="Layer_12" data-name="Layer 12">
    <g id="REGULAR">
      <g>
        <path class="cls-1" d="M275.8,39.94a9,9,0,0,0,8.35,5.51c3.4,0,6-1.44,6-4.35,0-2.28-1.56-3.2-4.24-3.84l-5-1.2c-3.32-.76-6-2.63-6-6.59,0-4.28,3.44-7.27,8.4-7.27,4.51,0,7.71,2.12,9.26,4.95l-2.23,2.44a7.47,7.47,0,0,0-7-4.52c-3.08,0-5.12,1.52-5.12,4.24,0,2.36,1.68,3.16,4.28,3.76l4.43,1c3.68.88,6.51,2.6,6.51,6.92,0,4.59-4,7.31-9.19,7.31-4.59,0-8.8-2.08-10.57-6Z"/>
        <path class="cls-1" d="M202.11,47.85H185.45V22.68h16.3v2.95H188.89V33.3H198v3h-9.15v8.59h13.22Z"/>
        <path class="cls-1" d="M220.59,40.5H211.4L209,47.85h-3.43L214,22.68h4.23l8.39,25.17H223Zm-8.27-2.8h7.39l-3.64-11.19h-.16Z"/>
        <path class="cls-1" d="M236,47.85,227.6,22.68h3.76l6.79,21h.16l6.71-21h3.6l-8.43,25.17Z"/>
        <path class="cls-1" d="M270.22,47.85H253.56V22.68h16.3v2.95H257V33.3h9.15v3H257v8.59h13.22Z"/>
        <path class="cls-1" d="M175.76,43.37H176l2.31-20.69h2.85l-3.27,25.17h-4.12l-3.6-20.57h-.23l-3.68,20.57h-4.12l-3.23-25.17H162l2.31,20.61h.2l3.68-20.61H172Z"/>
      </g>
      <g>
        <path class="cls-1" d="M34,48.33c-6.07,0-10.47-5.32-10.47-13.07S27.88,22.2,34,22.2s10.47,5.31,10.47,13.06S40,48.33,34,48.33Zm0-23.1c-4.15,0-6.87,3.88-6.87,10s2.72,10,6.87,10,6.87-3.87,6.87-10S38.11,25.23,34,25.23Z"/>
        <path class="cls-1" d="M52.36,37.78V47.85H48.89V22.68h8.63c6.23,0,9.78,2.83,9.78,7.55s-3.55,7.55-9.78,7.55Zm5.08-2.92c4.31,0,6.43-1.52,6.43-4.63s-2.12-4.64-6.43-4.64H52.36v9.27Z"/>
        <path class="cls-1" d="M88.64,47.85H72V22.68H88.28v2.95H75.41V33.3h9.15v3H75.41v8.59H88.64Z"/>
        <path class="cls-1" d="M108.77,42.18V22.68H112V47.85h-3.07L96.47,27.07V47.85H93.23V22.68h4.08Z"/>
      </g>
    </g>
  </g>
</svg>
