Menu des différents modes de jeux

Résolution : 

-	1920 px par 1080 px

Encadré noir :

-	L : 1920 px, H : 200 px, X : 0 px, Y : 0 px et Couleur : 000000

Titre Encadré noir :

-	L : 928 px, H : 142,31 px, X : 495,5 px, Y : 65,12 px, Arial, Regular, 200 pt et Couleur : ffffff

Ligne Verte :

-	L : 1920 px, H : 10 px, X : 0 px, Y : 200 px et Couleur : 2aff00

Encadré gris :

-	L : 1920px, H : 880 px, X : 0 px, Y : 200 px et Couleur : 818181

Texte Encadré gris : 

-	L : 692,29 px, H : 35,32 px, X : 613,56 px, Y : 270 px, Arial, Regular, 100 pt et Couleur : ffffff

Mode Classique :

- 	L : 300 px, H : 400 px, X : 93 px et Y : 415 px

Mode Chrono : 

-	L : 300 px, H : 400 px, X : 571 px et Y : 415 px

Mode Chrono 2 :

-	L : 300 px, H : 400 px, X : 1049 px et Y : 415 px

Mode But :

-	L : 300 px, H : 400 px, X : 1527 px et Y : 415 px






Page pour commencer la partie :

Résolution : 

-	1920 px par 1080 px

Encadré noir :

-	L : 1920 px, H : 200 px, X : 0 px, Y : 0 px et Couleur : 000000

Flêche Blanche Retour :

-	L : 91 px, H : 77 px, X : 82 px, Y : 62 px

Titre Encadré Noir : 

-	L : 277 px, H : 70,64 px, X : 821,5 px, Y : 64,81 px, Arial, Regular, 200 pt et Couleur : ffffff

Ligne Verte :

-	L : 1920 px, H : 10 px, X : 0 px, Y : 200 px et Couleur : 2aff00

Encadré gris :

-	L : 1920px, H : 880 px, X : 0 px, Y : 200 px et Couleur : 818181

Compteur de points :

-	L : 1574 px, H : 209 px, X : 173 px, Y : 244,5 px, Couleur de fond : 4f4f4f et Couleur du contour : 000000

Premier moins rouge :

-	L : 126 px, H : 126 px, X : 289 px, Y : 278 px

Premier plus vert : 

-	L : 126 px, H : 126 px, X : 481 px, Y : 278 px

Texte Compteur de Points : 

-	L : 1574 px, H : 209 px, X : 173 px, Y : 244,5 px, Arial, Regular, 500 pt et Couleur : ffffff

0 de gauche :

-	L : 80 px, H : 110 px, X : 801 px, Y : 300 px

Tiret entre les deux 0 : 

-	L : 50 px, H : 20 px, X : 933 px, Y : 359 px

Deuxieme moins rouge : 

-	L : 126 px, H : 126 px, X : 1313 px, Y : 278 px

Deuxieme plus vert : 

-	L : 126 px, H : 126 px, X : 1505 px, Y : 278 px

Drapeau bleu :

-	L : 95 px, H : 110 px, X : 290 px, Y : 480 px


Equipe bleu : 

-	L : 195 px, H : 38,85 px, X : 475 px, Y : 514,87 px, Arial, Regular, 110 pt et Couleur : ffffff

Drapeau rouge : 

-	L : 95 px, H : 110px, X : 1535 px, Y : 480 px

Equipe rouge : 

-	L : 195 px, H : 38,85 px, X : 1250 px, Y : 514,87 px, Arial, Regular, 110 pt et Couleur : ffffff

Timer :

-	L : 581,76 px, H : 211,93 px, X : 668,87 px, Y : 619,81 px, Arial, Regular, 600 pt et Couleur : ffffff

Bouton Recommencer :

-	L : 1513 px, H : 126 px, X : 204 px, Y : 866 px





Page pour arrêter ou mettre en pause la partie :


Résolution : 

-	1920 px par 1080 px

Encadré noir :

-	L : 1920 px, H : 200 px, X : 0 px, Y : 0 px et Couleur : 000000

Titre Encadré Noir : 

-	L : 277 px, H : 70,64 px, X : 821,5 px, Y : 64,81 px, Arial, Regular, 200 pt et Couleur : ffffff

Ligne Verte :

-	L : 1920 px, H : 10 px, X : 0 px, Y : 200 px et Couleur : 2aff00

Encadré gris :

-	L : 1920px, H : 880 px, X : 0 px, Y : 200 px et Couleur : 818181

Compteur de points :

-	L : 1574 px, H : 209 px, X : 173 px, Y : 244,5 px, Couleur de fond : 4f4f4f et Couleur du contour : 000000

Premier moins rouge :

-	L : 126 px, H : 126 px, X : 289 px, Y : 278 px

Premier plus vert : 

-	L : 126 px, H : 126 px, X : 481 px, Y : 278 px

Texte Compteur de Points : 

-	L : 1574 px, H : 209 px, X : 173 px, Y : 244,5 px, Arial, Regular, 500 pt et Couleur : ffffff

0 de gauche :

-	L : 80 px, H : 110 px, X : 801 px, Y : 300 px

Tiret entre les deux 0 : 

-	L : 50 px, H : 20 px, X : 933 px, Y : 359 px

0 de droite :

-	L : 77 px, H : 110 px, X : 1037 px, Y : 300 px

Deuxieme moins rouge : 

-	L : 126 px, H : 126 px, X : 1313 px, Y : 278 px

Deuxieme plus vert : 

-	L : 126 px, H : 126 px, X : 1505 px, Y : 278 px

Drapeau bleu :

-	L : 95 px, H : 110 px, X : 290 px, Y : 480 px


Equipe bleu : 

-	L : 195 px, H : 38,85 px, X : 475 px, Y : 514,87 px, Arial, Regular, 110 pt et Couleur : ffffff

Drapeau rouge : 

-	L : 95 px, H : 110px, X : 1535 px, Y : 480 px

Equipe rouge : 

-	L : 195 px, H : 38,85 px, X : 1250 px, Y : 514,87 px, Arial, Regular, 110 pt et Couleur : ffffff

Timer :

-	L : 581,76 px, H : 211,93 px, X : 668,87 px, Y : 619,81 px, Arial, Regular, 600 pt et Couleur : ffffff

Bouton Arrêter la partie :

-	L : 648 px, H : 126 px, X : 203 px, Y : 866 px

Bouton Mettre en pause la partie : 

-	L : 648 px, H : 126 px, X : 1069 px, Y : 866 px

