alabaster @ file:///home/ktietz/src/ci/alabaster_1611921544520/work
arrow @ file:///C:/b/abs_cal7u12ktb/croot/arrow_1676588147908/work
astroid @ file:///C:/b/abs_d4lg3_taxn/croot/astroid_1676904351456/work
asttokens @ file:///opt/conda/conda-bld/asttokens_1646925590279/work
atomicwrites==1.4.0
attrs @ file:///C:/b/abs_09s3y775ra/croot/attrs_1668696195628/work
autopep8 @ file:///opt/conda/conda-bld/autopep8_1650463822033/work
Babel @ file:///C:/b/abs_a2shv_3tqi/croot/babel_1671782804377/work
backcall @ file:///home/ktietz/src/ci/backcall_1611930011877/work
bcrypt @ file:///C:/Windows/Temp/abs_36kl66t_aw/croots/recipe/bcrypt_1659554334050/work
beautifulsoup4 @ file:///C:/ci/beautifulsoup4_1650293025093/work
binaryornot @ file:///tmp/build/80754af9/binaryornot_1617751525010/work
black @ file:///C:/ci/black_1660239974023/work
bleach @ file:///opt/conda/conda-bld/bleach_1641577558959/work
brotlipy==0.7.0
certifi @ file:///C:/b/abs_85o_6fm0se/croot/certifi_1671487778835/work/certifi
cffi @ file:///C:/b/abs_49n3v2hyhr/croot/cffi_1670423218144/work
chardet @ file:///C:/ci/chardet_1607706937985/work
charset-normalizer @ file:///tmp/build/80754af9/charset-normalizer_1630003229654/work
click @ file:///C:/ci/click_1646038595831/work
cloudpickle @ file:///tmp/build/80754af9/cloudpickle_1632508026186/work
colorama @ file:///C:/b/abs_a9ozq0l032/croot/colorama_1672387194846/work
comm @ file:///C:/b/abs_1419earm7u/croot/comm_1671231131638/work
contourpy==1.0.7
cookiecutter @ file:///opt/conda/conda-bld/cookiecutter_1649151442564/work
cryptography @ file:///C:/b/abs_8ecplyc3n2/croot/cryptography_1677533105000/work
cycler==0.11.0
debugpy @ file:///C:/ci/debugpy_1637091961445/work
decorator @ file:///opt/conda/conda-bld/decorator_1643638310831/work
defusedxml @ file:///tmp/build/80754af9/defusedxml_1615228127516/work
diff-match-patch @ file:///Users/ktietz/demo/mc3/conda-bld/diff-match-patch_1630511840874/work
dill @ file:///C:/b/abs_42h_07z1yj/croot/dill_1667919550096/work
distlib==0.3.6
docstring-to-markdown @ file:///C:/b/abs_cf10j8nr4q/croot/docstring-to-markdown_1673447652942/work
docutils @ file:///C:/Windows/TEMP/abs_24e5e278-4d1c-47eb-97b9-f761d871f482dy2vg450/croots/recipe/docutils_1657175444608/work
entrypoints @ file:///C:/ci/entrypoints_1649926621128/work
executing @ file:///opt/conda/conda-bld/executing_1646925071911/work
fastjsonschema @ file:///C:/Users/BUILDE~1/AppData/Local/Temp/abs_ebruxzvd08/croots/recipe/python-fastjsonschema_1661376484940/work
filelock==3.9.0
flake8 @ file:///C:/b/abs_9f6_n1jlpc/croot/flake8_1674581816810/work
flit_core @ file:///opt/conda/conda-bld/flit-core_1644941570762/work/source/flit_core
fonttools==4.38.0
idna @ file:///C:/b/abs_bdhbebrioa/croot/idna_1666125572046/work
imagesize @ file:///C:/Windows/TEMP/abs_3cecd249-3fc4-4bfc-b80b-bb227b0d701en12vqzot/croots/recipe/imagesize_1657179501304/work
importlib-metadata @ file:///C:/ci/importlib-metadata_1648562621412/work
importlib-resources==5.12.0
inflection==0.5.1
intervaltree @ file:///Users/ktietz/demo/mc3/conda-bld/intervaltree_1630511889664/work
ipykernel @ file:///C:/b/abs_b4f07tbsyd/croot/ipykernel_1672767104060/work
ipython @ file:///C:/b/abs_d3h279dv3h/croot/ipython_1676582236558/work
ipython-genutils @ file:///tmp/build/80754af9/ipython_genutils_1606773439826/work
isort @ file:///tmp/build/80754af9/isort_1628603791788/work
jedi @ file:///C:/ci/jedi_1644315428289/work
jellyfish @ file:///C:/ci/jellyfish_1647962783748/work
Jinja2 @ file:///C:/b/abs_7cdis66kl9/croot/jinja2_1666908141852/work
jinja2-time @ file:///opt/conda/conda-bld/jinja2-time_1649251842261/work
jsonschema @ file:///C:/b/abs_6ccs97j_l8/croot/jsonschema_1676558690963/work
jupyter_client @ file:///C:/b/abs_d8fk_kz9zk/croot/jupyter_client_1676330195659/work
jupyter_core @ file:///C:/b/abs_bd7elvu3w2/croot/jupyter_core_1676538600510/work
jupyterlab-pygments @ file:///tmp/build/80754af9/jupyterlab_pygments_1601490720602/work
keyring @ file:///C:/ci/keyring_1638531673471/work
kiwisolver==1.4.4
lazy-object-proxy @ file:///C:/ci/lazy-object-proxy_1616529288960/work
lxml @ file:///C:/ci/lxml_1657527445690/work
MarkupSafe @ file:///C:/ci/markupsafe_1654508077284/work
matplotlib==3.7.1
matplotlib-inline @ file:///C:/ci/matplotlib-inline_1661915841596/work
mccabe @ file:///opt/conda/conda-bld/mccabe_1644221741721/work
mistune @ file:///C:/ci/mistune_1607359457024/work
mypy-extensions==0.4.3
nbclient @ file:///C:/ci/nbclient_1650290387259/work
nbconvert @ file:///C:/b/abs_4av3q4okro/croot/nbconvert_1668450658054/work
nbformat @ file:///C:/b/abs_85_3g7dkt4/croot/nbformat_1670352343720/work
nest-asyncio @ file:///C:/b/abs_3a_4jsjlqu/croot/nest-asyncio_1672387322800/work
numpy==1.24.2
numpydoc @ file:///C:/b/abs_cfdd4zxbga/croot/numpydoc_1668085912100/work
packaging @ file:///C:/b/abs_cfsup8ur87/croot/packaging_1671697442297/work
pandocfilters @ file:///opt/conda/conda-bld/pandocfilters_1643405455980/work
paramiko @ file:///opt/conda/conda-bld/paramiko_1640109032755/work
parso @ file:///opt/conda/conda-bld/parso_1641458642106/work
pathspec @ file:///C:/b/abs_9cu5_2yb3i/croot/pathspec_1674681579249/work
pexpect @ file:///tmp/build/80754af9/pexpect_1605563209008/work
pickleshare @ file:///tmp/build/80754af9/pickleshare_1606932040724/work
Pillow==9.4.0
platformdirs @ file:///C:/b/abs_73cc5cz_1u/croots/recipe/platformdirs_1662711386458/work
pluggy @ file:///C:/ci/pluggy_1648024580010/work
ply==3.11
poyo @ file:///tmp/build/80754af9/poyo_1617751526755/work
prompt-toolkit @ file:///C:/b/abs_6coz5_9f2s/croot/prompt-toolkit_1672387908312/work
psutil @ file:///C:/Windows/Temp/abs_b2c2fd7f-9fd5-4756-95ea-8aed74d0039flsd9qufz/croots/recipe/psutil_1656431277748/work
ptyprocess @ file:///tmp/build/80754af9/ptyprocess_1609355006118/work/dist/ptyprocess-0.7.0-py2.py3-none-any.whl
pure-eval @ file:///opt/conda/conda-bld/pure_eval_1646925070566/work
pycodestyle @ file:///C:/b/abs_d77nxvklcq/croot/pycodestyle_1674267231034/work
pycparser @ file:///tmp/build/80754af9/pycparser_1636541352034/work
pydocstyle @ file:///C:/b/abs_6dz687_5i3/croot/pydocstyle_1675221688656/work
pyflakes @ file:///C:/b/abs_6dve6e13zh/croot/pyflakes_1674165143327/work
Pygments @ file:///opt/conda/conda-bld/pygments_1644249106324/work
pylint @ file:///C:/b/abs_83sq99jc8i/croot/pylint_1676919922167/work
pylint-venv @ file:///C:/b/abs_bf0lepsbij/croot/pylint-venv_1673990138593/work
pyls-spyder==0.4.0
PyNaCl @ file:///C:/Windows/Temp/abs_d5c3ajcm87/croots/recipe/pynacl_1659620667490/work
pyOpenSSL @ file:///C:/b/abs_552w85x1jz/croot/pyopenssl_1677607703691/work
pyparsing==3.0.9
PyQt5==5.15.7
PyQt5-sip @ file:///C:/Windows/Temp/abs_d7gmd2jg8i/croots/recipe/pyqt-split_1659273064801/work/pyqt_sip
PyQtWebEngine==5.15.4
pyrsistent @ file:///C:/ci/pyrsistent_1636093225342/work
PySocks @ file:///C:/ci/pysocks_1605307512533/work
python-dateutil @ file:///tmp/build/80754af9/python-dateutil_1626374649649/work
python-lsp-black @ file:///C:/Users/BUILDE~1/AppData/Local/Temp/abs_dddk9lhpp1/croots/recipe/python-lsp-black_1661852041405/work
python-lsp-jsonrpc==1.0.0
python-lsp-server @ file:///C:/b/abs_e44khh1wya/croot/python-lsp-server_1677296772730/work
python-slugify @ file:///tmp/build/80754af9/python-slugify_1620405669636/work
pytoolconfig @ file:///C:/b/abs_18sf9z_iwl/croot/pytoolconfig_1676315065270/work
pytz @ file:///C:/b/abs_22fofvpn1x/croot/pytz_1671698059864/work
pywin32==305.1
pywin32-ctypes @ file:///C:/ci/pywin32-ctypes_1607553594546/work
PyYAML==6.0
pyzmq @ file:///C:/ci/pyzmq_1657615952984/work
QDarkStyle @ file:///tmp/build/80754af9/qdarkstyle_1617386714626/work
qstylizer @ file:///C:/b/abs_ef86cgllby/croot/qstylizer_1674008538857/work/dist/qstylizer-0.2.2-py2.py3-none-any.whl
QtAwesome @ file:///C:/b/abs_c5evilj98g/croot/qtawesome_1674008690220/work
qtconsole @ file:///C:/b/abs_5bap7f8n0t/croot/qtconsole_1674008444833/work
QtPy @ file:///C:/ci/qtpy_1662015096047/work
requests @ file:///C:/ci/requests_1657735342357/work
rope @ file:///C:/b/abs_55g_tm_6ff/croot/rope_1676675029164/work
Rtree @ file:///C:/b/abs_e116ltblik/croot/rtree_1675157871717/work
sip @ file:///C:/Windows/Temp/abs_b8fxd17m2u/croots/recipe/sip_1659012372737/work
six @ file:///tmp/build/80754af9/six_1644875935023/work
snowballstemmer @ file:///tmp/build/80754af9/snowballstemmer_1637937080595/work
sortedcontainers @ file:///tmp/build/80754af9/sortedcontainers_1623949099177/work
soupsieve @ file:///C:/b/abs_fasraqxhlv/croot/soupsieve_1666296394662/work
Sphinx @ file:///C:/ci/sphinx_1657617205740/work
sphinxcontrib-applehelp @ file:///home/ktietz/src/ci/sphinxcontrib-applehelp_1611920841464/work
sphinxcontrib-devhelp @ file:///home/ktietz/src/ci/sphinxcontrib-devhelp_1611920923094/work
sphinxcontrib-htmlhelp @ file:///tmp/build/80754af9/sphinxcontrib-htmlhelp_1623945626792/work
sphinxcontrib-jsmath @ file:///home/ktietz/src/ci/sphinxcontrib-jsmath_1611920942228/work
sphinxcontrib-qthelp @ file:///home/ktietz/src/ci/sphinxcontrib-qthelp_1611921055322/work
sphinxcontrib-serializinghtml @ file:///tmp/build/80754af9/sphinxcontrib-serializinghtml_1624451540180/work
spyder @ file:///C:/b/abs_93s9xkw3pn/croot/spyder_1677776163871/work
spyder-kernels @ file:///C:/b/abs_feh4xo1mrn/croot/spyder-kernels_1673292245176/work
stack-data @ file:///opt/conda/conda-bld/stack_data_1646927590127/work
text-unidecode @ file:///Users/ktietz/demo/mc3/conda-bld/text-unidecode_1629401354553/work
textdistance @ file:///tmp/build/80754af9/textdistance_1612461398012/work
three-merge @ file:///tmp/build/80754af9/three-merge_1607553261110/work
tinycss2 @ file:///C:/b/abs_52w5vfuaax/croot/tinycss2_1668168823131/work
toml @ file:///tmp/build/80754af9/toml_1616166611790/work
tomli @ file:///C:/Windows/TEMP/abs_ac109f85-a7b3-4b4d-bcfd-52622eceddf0hy332ojo/croots/recipe/tomli_1657175513137/work
tomlkit @ file:///C:/Windows/TEMP/abs_3296qo9v6b/croots/recipe/tomlkit_1658946894808/work
tornado @ file:///C:/ci/tornado_1662458743919/work
traitlets @ file:///C:/b/abs_e5m_xjjl94/croot/traitlets_1671143896266/work
typing_extensions @ file:///C:/b/abs_89eui86zuq/croot/typing_extensions_1669923792806/work
ujson @ file:///C:/ci/ujson_1657525944442/work
Unidecode @ file:///tmp/build/80754af9/unidecode_1614712377438/work
urllib3 @ file:///C:/b/abs_9bcwxczrvm/croot/urllib3_1673575521331/work
virtualenv==20.20.0
watchdog @ file:///C:/ci/watchdog_1638367441841/work
wcwidth @ file:///Users/ktietz/demo/mc3/conda-bld/wcwidth_1629357192024/work
webencodings==0.5.1
whatthepatch @ file:///C:/Users/BUILDE~1/AppData/Local/Temp/abs_e7bihs8grh/croots/recipe/whatthepatch_1661796085215/work
win-inet-pton @ file:///C:/ci/win_inet_pton_1605306162074/work
wincertstore==0.2
wrapt @ file:///C:/Windows/Temp/abs_7c3dd407-1390-477a-b542-fd15df6a24085_diwiza/croots/recipe/wrapt_1657814452175/work
yapf @ file:///tmp/build/80754af9/yapf_1615749224965/work
zipp @ file:///C:/b/abs_b9jfdr908q/croot/zipp_1672387552360/work
