com/mvp/cartoes/pagamento/models/dto/CreatePagamentoRequest.class
com/mvp/cartoes/pagamento/service/PagamentoService.class
com/mvp/cartoes/pagamento/cartao/CartaoDto.class
com/mvp/cartoes/pagamento/models/mapper/PagamentoMapper.class
com/mvp/cartoes/pagamento/PagamentoApplication.class
com/mvp/cartoes/pagamento/utils/exceptions/ManipuladorDeExcecoes.class
com/mvp/cartoes/pagamento/utils/erros/models/Erro.class
com/mvp/cartoes/pagamento/controller/PagamentoController.class
com/mvp/cartoes/pagamento/repository/PagamentoRepository.class
com/mvp/cartoes/pagamento/models/Pagamento.class
com/mvp/cartoes/pagamento/cartao/CartaoServiceClient.class
com/mvp/cartoes/pagamento/utils/erros/models/RespostaDeErro.class
com/mvp/cartoes/pagamento/utils/erros/models/ObjetoDeErro.class
com/mvp/cartoes/pagamento/models/dto/PagamentoResponse.class
