com/mvp/cartoes/cartao/models/dto/create/CreateCartaoResponse.class
com/mvp/cartoes/cartao/service/CartaoService.class
com/mvp/cartoes/cartao/models/dto/update/UpdateCartaoRequest.class
com/mvp/cartoes/cartao/client/ClienteServiceClient.class
com/mvp/cartoes/cartao/utils/erros/models/RespostaDeErro.class
com/mvp/cartoes/cartao/models/dto/get/GetCartaoResponse.class
com/mvp/cartoes/cartao/client/ClientDto.class
com/mvp/cartoes/cartao/models/Cartao.class
com/mvp/cartoes/cartao/models/dto/update/UpdateCartaoResponse.class
com/mvp/cartoes/cartao/models/dto/create/CreateCartaoRequest.class
com/mvp/cartoes/cartao/utils/exceptions/CartaoNotFoundException.class
com/mvp/cartoes/cartao/utils/exceptions/ClienteNotFoundException.class
com/mvp/cartoes/cartao/models/mapper/CartaoMapper.class
com/mvp/cartoes/cartao/utils/exceptions/ManipuladorDeExcecoes.class
com/mvp/cartoes/cartao/utils/erros/models/ObjetoDeErro.class
com/mvp/cartoes/cartao/utils/erros/models/Erro.class
com/mvp/cartoes/cartao/repository/CartaoRepository.class
com/mvp/cartoes/cartao/controller/CartaoController.class
