\relax 
\bbl@beforestart
\providecommand\HyperFirstAtBeginDocument{\AtBeginDocument}
\HyperFirstAtBeginDocument{\ifx\hyper@anchor\@undefined
\global\let\oldcontentsline\contentsline
\gdef\contentsline#1#2#3#4{\oldcontentsline{#1}{#2}{#3}}
\global\let\oldnewlabel\newlabel
\gdef\newlabel#1#2{\newlabelxx{#1}#2}
\gdef\newlabelxx#1#2#3#4#5#6{\oldnewlabel{#1}{{#2}{#3}}}
\AtEndDocument{\ifx\hyper@anchor\@undefined
\let\contentsline\oldcontentsline
\let\newlabel\oldnewlabel
\fi}
\fi}
\global\let\hyper@last\relax 
\gdef\HyperFirstAtBeginDocument#1{#1}
\providecommand\HyField@AuxAddToFields[1]{}
\providecommand\HyField@AuxAddToCoFields[2]{}
\babel@aux{english}{}
\providecommand {\FN@pp@footnotehinttrue }{}
\providecommand {\FN@pp@footnote@aux }[2]{}
\FN@pp@footnotehinttrue 
\FN@pp@footnotehinttrue 
\FN@pp@footnotehinttrue 
\citation{Moerman2017JIMWLK}
\citation{alcock2017compact,alcock2017simplification,alcock2017transition}
\@writefile{toc}{\contentsline {chapter}{Abstract}{iii}{section*.1}\protected@file@percent }
\FN@pp@footnotehinttrue 
\@writefile{toc}{\contentsline {chapter}{Acknowledgements}{v}{section*.2}\protected@file@percent }
\FN@pp@footnotehinttrue 
\FN@pp@footnotehinttrue 
\FN@pp@footnotehinttrue 
\citation{gribov1983semihard,mueller2002parton,jalilian2006saturation}
\citation{iancu2002color,iancu2003color,weigert2005evolution,gelis2010color,kovchegov2012quantum}
\citation{iancu2002geometric}
\citation{weigert2005evolution}
\citation{iancu2002geometric}
\citation{weigert2005evolution}
\FN@pp@footnotehinttrue 
\@writefile{toc}{\contentsline {chapter}{\numberline {1}Introduction}{1}{chapter.1}\protected@file@percent }
\@writefile{lof}{\addvspace {10\p@ }}
\@writefile{lot}{\addvspace {10\p@ }}
\@writefile{toc}{\contentsline {section}{\numberline {1.1}Background: The Color Glass Condensate and the JIMWLK equation}{1}{section.1.1}\protected@file@percent }
\citation{kovchegov1999small,kovchegov2000unitarization,balitsky1996operator,balitsky1997operator,balitsky1999factorization}
\citation{kovchegov2012quantum}
\citation{marquet2010new}
\@writefile{lof}{\contentsline {figure}{\numberline {1.1}{\ignorespaces QCD phase diagram. Colored dots represent the partons in the target, whose effect size visible to a probe increases with decreases in $Q^2$. As $x_{bj}$ decreases at fixed $Q^2$, the number of partons increases until at sufficiently small $x_{bj}$, the target can no longer be considered dilute and a new state of matter forms (the CGC). In the extended scaling region, the evolution equations of the CGC and the parton gas agree in the appropriate limits (see \cite  {iancu2002geometric} and \cite  [Sec.~3.7]{weigert2005evolution} for details).\relax }}{2}{figure.caption.5}\protected@file@percent }
\providecommand*\caption@xref[2]{\@setref\relax\@undefined{#1}}
\newlabel{figure_qcd_phase_diagram}{{1.1}{2}{QCD phase diagram. Colored dots represent the partons in the target, whose effect size visible to a probe increases with decreases in $Q^2$. As $x_{bj}$ decreases at fixed $Q^2$, the number of partons increases until at sufficiently small $x_{bj}$, the target can no longer be considered dilute and a new state of matter forms (the CGC). In the extended scaling region, the evolution equations of the CGC and the parton gas agree in the appropriate limits (see \cite {iancu2002geometric} and \cite [Sec.~3.7]{weigert2005evolution} for details).\relax }{figure.caption.5}{}}
\newlabel{figure_qcd_phase_diagram@cref}{{[figure][1][1]1.1}{[1][1][]2}}
\citation{kovchegov2009subleading,marquet2010new,lappi2016jimwlk}
\citation{Moerman2017JIMWLK}
\citation{keppeler2012orthogonal}
\citation{edison2012symmetric}
\citation{alcock2017compact,alcock2017transition,alcock2017simplification}
\citation{Moerman2017JIMWLK}
\@writefile{toc}{\contentsline {section}{\numberline {1.2}Purpose of this dissertation}{3}{section.1.2}\protected@file@percent }
\FN@pp@footnotehinttrue 
\citation{Moerman2017JIMWLK}
\@writefile{toc}{\contentsline {chapter}{\numberline {2}A novel parameterisation of JIMWLK evolution}{5}{chapter.2}\protected@file@percent }
\@writefile{lof}{\addvspace {10\p@ }}
\@writefile{lot}{\addvspace {10\p@ }}
\newlabel{chapter_novel_parameterisation}{{2}{5}{A novel parameterisation of JIMWLK evolution}{chapter.2}{}}
\newlabel{chapter_novel_parameterisation@cref}{{[chapter][2][]2}{[1][5][]5}}
\citation{iancu2016cgc}
\@writefile{toc}{\contentsline {section}{\numberline {2.1}The Problem: JIMWLK generates an infinite hierarchy of coupled differential equations}{6}{section.2.1}\protected@file@percent }
\newlabel{section_infinite_hierarchy_problem}{{2.1}{6}{The Problem: JIMWLK generates an infinite hierarchy of coupled differential equations}{section.2.1}{}}
\newlabel{section_infinite_hierarchy_problem@cref}{{[section][1][2]2.1}{[1][6][]6}}
\newlabel{equation_CGC_weight_function_evolution}{{2.1}{6}{The Problem: JIMWLK generates an infinite hierarchy of coupled differential equations}{equation.2.1.1}{}}
\newlabel{equation_CGC_weight_function_evolution@cref}{{[equation][1][2]2.1}{[1][6][]6}}
\newlabel{JIMWLK_CGC_correlator}{{2.2}{6}{The Problem: JIMWLK generates an infinite hierarchy of coupled differential equations}{equation.2.1.2}{}}
\newlabel{JIMWLK_CGC_correlator@cref}{{[equation][2][2]2.2}{[1][6][]6}}
\newlabel{JIMWLK_invariant_vector_fields}{{2.5}{6}{The Problem: JIMWLK generates an infinite hierarchy of coupled differential equations}{equation.2.1.5}{}}
\newlabel{JIMWLK_invariant_vector_fields@cref}{{[equation][5][2]2.5}{[1][6][]6}}
\FN@pp@footnote@aux{1}{6}
\newlabel{JIMWLK_correlator_evolution}{{2.8}{7}{The Problem: JIMWLK generates an infinite hierarchy of coupled differential equations}{equation.2.1.8}{}}
\newlabel{JIMWLK_correlator_evolution@cref}{{[equation][8][2]2.8}{[1][7][]7}}
\newlabel{JIMWLK_hamiltonian_mixed_terms}{{2.10}{8}{The Problem: JIMWLK generates an infinite hierarchy of coupled differential equations}{equation.2.1.10}{}}
\newlabel{JIMWLK_hamiltonian_mixed_terms@cref}{{[equation][10][2]2.10}{[1][8][]8}}
\newlabel{JIMWLK_figure_quark_gluon_emission}{{2.1a}{8}{Subfigure 2 2.1a}{subfigure.2.1.1}{}}
\newlabel{sub@JIMWLK_figure_quark_gluon_emission}{{(a)}{a}{Subfigure 2 2.1a\relax }{subfigure.2.1.1}{}}
\newlabel{JIMWLK_figure_quark_gluon_emission@cref}{{[subfigure][1][2,1]2.1a}{[1][8][]8}}
\newlabel{JIMWLK_figure_quark_gluon_gluon_emission}{{2.1b}{8}{Subfigure 2 2.1b}{subfigure.2.1.2}{}}
\newlabel{sub@JIMWLK_figure_quark_gluon_gluon_emission}{{(b)}{b}{Subfigure 2 2.1b\relax }{subfigure.2.1.2}{}}
\newlabel{JIMWLK_figure_quark_gluon_gluon_emission@cref}{{[subfigure][2][2,1]2.1b}{[1][8][]8}}
\@writefile{lof}{\contentsline {figure}{\numberline {2.1}{\ignorespaces A stylised depiction of the physics captured by the JIMWLK equation. An incoming quark (black directioned line) interacts with the Lorentz-contracted target (depicted as a blue plane) through the emission and reabsorption of gluons.\relax }}{8}{figure.caption.6}\protected@file@percent }
\@writefile{lof}{\contentsline {subfigure}{\numberline{(a)}{\ignorespaces {Quark emits a gluon, which interacts with the target background field.}}}{8}{subfigure.1.1}\protected@file@percent }
\@writefile{lof}{\contentsline {subfigure}{\numberline{(b)}{\ignorespaces {Gluon that interacts with the target emits and reabsorbs a gluon that also interacts with the target.}}}{8}{subfigure.1.2}\protected@file@percent }
\@writefile{toc}{\contentsline {subsection}{\numberline {2.1.1}Dipole correlator evolution depends on the 3-point function}{9}{subsection.2.1.1}\protected@file@percent }
\newlabel{JIMWLK_dipole_evolution_equation}{{2.11}{9}{Dipole correlator evolution depends on the 3-point function}{equation.2.1.11}{}}
\newlabel{JIMWLK_dipole_evolution_equation@cref}{{[equation][11][2]2.11}{[1][9][]9}}
\citation{balitsky1996operator,kovchegov1999small}
\newlabel{JIMWLK_dipole_evolution_equation_result}{{2.14}{10}{Dipole correlator evolution depends on the 3-point function}{equation.2.1.14}{}}
\newlabel{JIMWLK_dipole_evolution_equation_result@cref}{{[subequation][14][2]2.14}{[1][10][]10}}
\citation{marquet2010new}
\@writefile{toc}{\contentsline {subsection}{\numberline {2.1.2}The evolution of higher correlators is naturally organised as a matrix equation}{11}{subsection.2.1.2}\protected@file@percent }
\newlabel{section_introducing_amplitude_matrix}{{2.1.2}{11}{The evolution of higher correlators is naturally organised as a matrix equation}{subsection.2.1.2}{}}
\newlabel{section_introducing_amplitude_matrix@cref}{{[subsection][2][2,1]2.1.2}{[1][11][]11}}
\citation{marquet2010new}
\citation{Moerman2017JIMWLK}
\newlabel{equation_two_qBarq_amplitude_matrix_coincidence_limit}{{2.19}{12}{The evolution of higher correlators is naturally organised as a matrix equation}{equation.2.1.19}{}}
\newlabel{equation_two_qBarq_amplitude_matrix_coincidence_limit@cref}{{[subequation][19][2]2.19}{[1][12][]12}}
\citation{weigert2002unitarity}
\citation{weigert2002unitarity}
\@writefile{toc}{\contentsline {section}{\numberline {2.2}A brief summary: some existing approximate solutions to the JIMWLK equation and their limitations}{13}{section.2.2}\protected@file@percent }
\newlabel{section_existing_methods_and_limitations}{{2.2}{13}{A brief summary: some existing approximate solutions to the JIMWLK equation and their limitations}{section.2.2}{}}
\newlabel{section_existing_methods_and_limitations@cref}{{[section][2][2]2.2}{[1][13][]13}}
\citation{kovchegov1999small,kovchegov2000unitarization,balitsky1996operator,balitsky1997operator,balitsky1999factorization}
\citation{kovchegov2012quantum}
\citation{rummukainen2004universal,kovchegov2009subleading}
\citation{marquet2010new}
\citation{kovchegov2009subleading}
\citation{kovchegov2009subleading,marquet2010new}
\citation{jalilian1997intrinsic}
\citation{marquet2010new}
\citation{kovchegov2009subleading}
\citation{Moerman2017JIMWLK}
\citation{kovchegov2009subleading,marquet2010new,lappi2016jimwlk}
\citation{Moerman2017JIMWLK}
\citation{Moerman2017JIMWLK}
\@writefile{toc}{\contentsline {section}{\numberline {2.3}A novel parameterisation gives us a finite $N_c$ truncation that respects coincidence limits}{15}{section.2.3}\protected@file@percent }
\newlabel{section_truncation}{{2.3}{15}{A novel parameterisation gives us a finite $N_c$ truncation that respects coincidence limits}{section.2.3}{}}
\newlabel{section_truncation@cref}{{[section][3][2]2.3}{[1][14][]15}}
\citation{Moerman2017JIMWLK}
\FN@pp@footnote@aux{2}{16}
\newlabel{exponential_parameterization_differential_equation}{{2.28}{16}{A novel parameterisation gives us a finite $N_c$ truncation that respects coincidence limits}{equation.2.3.28}{}}
\newlabel{exponential_parameterization_differential_equation@cref}{{[equation][28][2]2.28}{[1][16][]16}}
\citation{Moerman2017JIMWLK}
\newlabel{exponential_parameterization_differential_equation_solution}{{2.29}{17}{A novel parameterisation gives us a finite $N_c$ truncation that respects coincidence limits}{equation.2.3.29}{}}
\newlabel{exponential_parameterization_differential_equation_solution@cref}{{[subequation][29][2]2.29}{[1][17][]17}}
\newlabel{exponential_parameterization_operators}{{2.30}{17}{A novel parameterisation gives us a finite $N_c$ truncation that respects coincidence limits}{equation.2.3.30}{}}
\newlabel{exponential_parameterization_operators@cref}{{[subequation][30][2]2.30}{[1][17][]17}}
\FN@pp@footnote@aux{3}{17}
\FN@pp@footnote@aux{4}{17}
\citation{kovchegov2009subleading,marquet2010new}
\citation{kovchegov2009subleading,lappi2016jimwlk}
\citation{Moerman2017JIMWLK}
\citation{Moerman2017JIMWLK}
\FN@pp@footnote@aux{5}{18}
\newlabel{truncation_operators_k2}{{2.31}{18}{A novel parameterisation gives us a finite $N_c$ truncation that respects coincidence limits}{equation.2.3.31}{}}
\newlabel{truncation_operators_k2@cref}{{[equation][31][2]2.31}{[1][18][]18}}
\FN@pp@footnote@aux{6}{18}
\FN@pp@footnote@aux{7}{18}
\newlabel{truncation_operators_k3}{{2.32}{18}{A novel parameterisation gives us a finite $N_c$ truncation that respects coincidence limits}{equation.2.3.32}{}}
\newlabel{truncation_operators_k3@cref}{{[equation][32][2]2.32}{[1][18][]18}}
\newlabel{exponential_parameterization_action_of_operators}{{2.33}{18}{A novel parameterisation gives us a finite $N_c$ truncation that respects coincidence limits}{equation.2.3.33}{}}
\newlabel{exponential_parameterization_action_of_operators@cref}{{[subequation][33][2]2.33}{[1][18][]18}}
\citation{Moerman2017JIMWLK}
\citation{Moerman2017JIMWLK}
\citation{Moerman2017JIMWLK}
\FN@pp@footnote@aux{8}{20}
\citation{Moerman2017JIMWLK}
\FN@pp@footnotehinttrue 
\@writefile{toc}{\contentsline {chapter}{\numberline {3}New color singlet space calculations}{23}{chapter.3}\protected@file@percent }
\@writefile{lof}{\addvspace {10\p@ }}
\@writefile{lot}{\addvspace {10\p@ }}
\newlabel{chapter_color}{{3}{23}{New color singlet space calculations}{chapter.3}{}}
\newlabel{chapter_color@cref}{{[chapter][3][]3}{[1][23][]23}}
\citation{keppeler2012orthogonal,keppeler2017birdtracks}
\citation{keppeler2012orthogonal}
\citation{keppeler2017birdtracks}
\@writefile{toc}{\contentsline {section}{\numberline {3.1}Color singlet space}{24}{section.3.1}\protected@file@percent }
\newlabel{section_color_space}{{3.1}{24}{Color singlet space}{section.3.1}{}}
\newlabel{section_color_space@cref}{{[section][1][3]3.1}{[1][24][]24}}
\FN@pp@footnote@aux{9}{24}
\newlabel{color_space_inner_product}{{3.2}{24}{Color singlet space}{equation.3.1.2}{}}
\newlabel{color_space_inner_product@cref}{{[equation][2][3]3.2}{[1][24][]24}}
\citation{keppeler2012orthogonal}
\citation{stanley1996enumerative}
\@writefile{toc}{\contentsline {section}{\numberline {3.2}The trace basis}{25}{section.3.2}\protected@file@percent }
\newlabel{section_trace_basis}{{3.2}{25}{The trace basis}{section.3.2}{}}
\newlabel{section_trace_basis@cref}{{[section][2][3]3.2}{[1][24][]25}}
\newlabel{color_space_subfactorial}{{3.5}{25}{The trace basis}{equation.3.2.5}{}}
\newlabel{color_space_subfactorial@cref}{{[subequation][5][3]3.5}{[1][25][]25}}
\citation{keppeler2012orthogonal}
\citation{rashid1973identity}
\citation{kovchegov2009subleading,marquet2010new}
\citation{kovchegov2009subleading,lappi2016jimwlk}
\citation{alcock2017compact}
\@writefile{toc}{\contentsline {section}{\numberline {3.3}Hermitian Young projection operator basis}{26}{section.3.3}\protected@file@percent }
\newlabel{section_hermitian_young_projectors_applied}{{3.3}{26}{Hermitian Young projection operator basis}{section.3.3}{}}
\newlabel{section_hermitian_young_projectors_applied@cref}{{[section][3][3]3.3}{[1][26][]26}}
\@writefile{toc}{\contentsline {subsection}{\numberline {3.3.1}Outline of the construction}{27}{subsection.3.3.1}\protected@file@percent }
\newlabel{section_constructing_basis_using_hermitian_projectors}{{3.3.1}{27}{Outline of the construction}{subsection.3.3.1}{}}
\newlabel{section_constructing_basis_using_hermitian_projectors@cref}{{[subsection][1][3,3]3.3.1}{[1][27][]27}}
\FN@pp@footnote@aux{10}{27}
\citation{sagan2013symmetric}
\citation{alcock2017compact,alcock2017transition,alcock2017simplification}
\citation{keppeler2014hermitian}
\citation{keppeler2014hermitian}
\FN@pp@footnote@aux{11}{28}
\newlabel{equation_orthogonality_inner_product_hermitian_young_projection_operators}{{3.13}{29}{Outline of the construction}{equation.3.3.13}{}}
\newlabel{equation_orthogonality_inner_product_hermitian_young_projection_operators@cref}{{[equation][13][3]3.13}{[1][29][]29}}
\citation{tung1985group}
\citation{doty2004new}
\citation{doty2004new}
\citation{cvitanovic2008group}
\citation{alcock2017transition}
\@writefile{lof}{\contentsline {figure}{\numberline {3.1}{\ignorespaces Flow chart explaining how Schur-Weyl duality connects the Hermitian Young projection operators and irreducible representations of $SU(N_c)$ on $V^{\otimes k}$ to irreducible representations of $S_k$ on $\mathcal  {S}(A^{\otimes k})$ (the adjoint color singlet space).\relax }}{30}{figure.caption.7}\protected@file@percent }
\newlabel{figure_schur_weyl_duality_flow_chart}{{3.1}{30}{Flow chart explaining how Schur-Weyl duality connects the Hermitian Young projection operators and irreducible representations of $SU(N_c)$ on $V^{\otimes k}$ to irreducible representations of $S_k$ on $\mathcal {S}(A^{\otimes k})$ (the adjoint color singlet space).\relax }{figure.caption.7}{}}
\newlabel{figure_schur_weyl_duality_flow_chart@cref}{{[figure][1][3]3.1}{[1][30][]30}}
\citation{kovchegov2009subleading,marquet2010new}
\@writefile{toc}{\contentsline {subsection}{\numberline {3.3.2}Hermitian Young projectors applied to the trace basis for $k = 2, 3$}{31}{subsection.3.3.2}\protected@file@percent }
\newlabel{equation_adjoint_color_space_projections_k2}{{3.15}{31}{Hermitian Young projectors applied to the trace basis for $k = 2, 3$}{equation.3.3.15}{}}
\newlabel{equation_adjoint_color_space_projections_k2@cref}{{[subequation][15][3]3.15}{[1][31][]31}}
\citation{kovchegov2009subleading}
\citation{lappi2016jimwlk}
\citation{cvitanovic2008group}
\newlabel{equation_adjoint_color_space_projections_k3}{{3.18}{32}{Hermitian Young projectors applied to the trace basis for $k = 2, 3$}{equation.3.3.18}{}}
\newlabel{equation_adjoint_color_space_projections_k3@cref}{{[subequation][18][3]3.18}{[1][31][]32}}
\@writefile{toc}{\contentsline {subsection}{\numberline {3.3.3}New calculation: Hermitian Young projection operator basis, $k = 4$}{33}{subsection.3.3.3}\protected@file@percent }
\newlabel{section_basis_k4}{{3.3.3}{33}{New calculation: Hermitian Young projection operator basis, $k = 4$}{subsection.3.3.3}{}}
\newlabel{section_basis_k4@cref}{{[subsection][3][3,3]3.3.3}{[1][32][]33}}
\FN@pp@footnote@aux{12}{33}
\newlabel{equation_adjoint_color_space_projections_k4}{{3.21}{34}{New calculation: Hermitian Young projection operator basis, $k = 4$}{equation.3.3.21}{}}
\newlabel{equation_adjoint_color_space_projections_k4@cref}{{[subequation][21][3]3.21}{[1][34][]34}}
\@writefile{lot}{\contentsline {table}{\numberline {3.1}{\ignorespaces Dimensions of the subspaces of the adjoint color singlet space that the Hermitian Young projection operators project onto when $k=4$\relax }}{35}{table.caption.8}\protected@file@percent }
\newlabel{table_adjoint_color_structure_subspace_dimensions_k4}{{3.1}{35}{Dimensions of the subspaces of the adjoint color singlet space that the Hermitian Young projection operators project onto when $k=4$\relax }{table.caption.8}{}}
\newlabel{table_adjoint_color_structure_subspace_dimensions_k4@cref}{{[table][1][3]3.1}{[1][34][]35}}
\newlabel{adjoint_color_structures_fourth_order}{{3.22}{35}{New calculation: Hermitian Young projection operator basis, $k = 4$}{equation.3.3.22}{}}
\newlabel{adjoint_color_structures_fourth_order@cref}{{[subequation][22][3]3.22}{[1][35][]35}}
\newlabel{equation_adjoint_decomposition_k4}{{3.23}{35}{New calculation: Hermitian Young projection operator basis, $k = 4$}{equation.3.3.23}{}}
\newlabel{equation_adjoint_decomposition_k4@cref}{{[equation][23][3]3.23}{[1][35][]35}}
\newlabel{equation_failed_orthogonality_k4}{{3.24}{35}{New calculation: Hermitian Young projection operator basis, $k = 4$}{equation.3.3.24}{}}
\newlabel{equation_failed_orthogonality_k4@cref}{{[equation][24][3]3.24}{[1][35][]35}}
\citation{macfarlane1968gell,rashid1973identity,cvitanovic1976group}
\@writefile{lot}{\contentsline {table}{\numberline {3.2}{\ignorespaces The adjoint color structures at $k=4$ are all real or purely imaginary, according to their associated Young diagram.\relax }}{36}{table.caption.9}\protected@file@percent }
\newlabel{adjoint_color_structure_complex_type}{{3.2}{36}{The adjoint color structures at $k=4$ are all real or purely imaginary, according to their associated Young diagram.\relax }{table.caption.9}{}}
\newlabel{adjoint_color_structure_complex_type@cref}{{[table][2][3]3.2}{[1][36][]36}}
\@writefile{toc}{\contentsline {section}{\numberline {3.4}Summary of \Cref  *{chapter_color}}{37}{section.3.4}\protected@file@percent }
\citation{macfarlane1968gell,rashid1973identity,cvitanovic1976group}
\citation{rashid1973identity,cvitanovic1976group}
\FN@pp@footnotehinttrue 
\@writefile{toc}{\contentsline {chapter}{\numberline {4}Tricks from representation theory teach us more about the Hermitian Young projection operator basis}{39}{chapter.4}\protected@file@percent }
\@writefile{lof}{\addvspace {10\p@ }}
\@writefile{lot}{\addvspace {10\p@ }}
\newlabel{chapter_basis_theory}{{4}{39}{Tricks from representation theory teach us more about the Hermitian Young projection operator basis}{chapter.4}{}}
\newlabel{chapter_basis_theory@cref}{{[chapter][4][]4}{[1][39][]39}}
\citation{Moerman2017JIMWLK}
\citation{edison2012symmetric}
\citation{bishop1993group}
\citation{wilson1955molecular,dresselhaus2007group}
\citation{hall2015lie}
\citation{tung1985group}
\FN@pp@footnote@aux{13}{40}
\FN@pp@footnote@aux{14}{40}
\@writefile{toc}{\contentsline {section}{\numberline {4.1}Characters give us the multiplicity of irreducible representations}{41}{section.4.1}\protected@file@percent }
\newlabel{section_characters_introduction}{{4.1}{41}{Characters give us the multiplicity of irreducible representations}{section.4.1}{}}
\newlabel{section_characters_introduction@cref}{{[section][1][4]4.1}{[1][41][]41}}
\citation{cornwell1985group}
\newlabel{equation_conjugate_character_inverse}{{4.3}{42}{Characters give us the multiplicity of irreducible representations}{equation.4.1.3}{}}
\newlabel{equation_conjugate_character_inverse@cref}{{[equation][3][4]4.3}{[1][42][]42}}
\citation{serre2012linear,sagan2013symmetric,fulton2013representation}
\citation{sagan2013symmetric}
\newlabel{equation_define_character_inner_product}{{4.5}{43}{Characters give us the multiplicity of irreducible representations}{equation.4.1.5}{}}
\newlabel{equation_define_character_inner_product@cref}{{[subequation][5][4]4.5}{[1][42][]43}}
\newlabel{equation_define_character_inner_product_first_def}{{4.5a}{43}{Characters give us the multiplicity of irreducible representations}{equation.4.1.5a}{}}
\newlabel{equation_define_character_inner_product_first_def@cref}{{[subequation][1][4,5]4.5a}{[1][42][]43}}
\newlabel{character_orthogonality}{{4.6}{43}{Characters give us the multiplicity of irreducible representations}{equation.4.1.6}{}}
\newlabel{character_orthogonality@cref}{{[subequation][6][4]4.6}{[1][43][]43}}
\FN@pp@footnote@aux{15}{43}
\newlabel{equation_decomposition_v}{{4.11}{44}{Characters give us the multiplicity of irreducible representations}{equation.4.1.11}{}}
\newlabel{equation_decomposition_v@cref}{{[equation][11][4]4.11}{[1][44][]44}}
\newlabel{equation_grouping_isomorphic_irreps}{{4.12}{44}{Characters give us the multiplicity of irreducible representations}{equation.4.1.12}{}}
\newlabel{equation_grouping_isomorphic_irreps@cref}{{[equation][12][4]4.12}{[1][44][]44}}
\newlabel{character_multiplicity_irrep}{{4.14}{45}{Characters give us the multiplicity of irreducible representations}{equation.4.1.14}{}}
\newlabel{character_multiplicity_irrep@cref}{{[equation][14][4]4.14}{[1][45][]45}}
\@writefile{toc}{\contentsline {section}{\numberline {4.2}Modules, induced representations, and Frobenius reciprocity}{45}{section.4.2}\protected@file@percent }
\newlabel{section_modules_induced_representations_frobenius}{{4.2}{45}{Modules, induced representations, and Frobenius reciprocity}{section.4.2}{}}
\newlabel{section_modules_induced_representations_frobenius@cref}{{[section][2][4]4.2}{[1][45][]45}}
\newlabel{definition_group_action}{{4.2.1}{46}{Group action}{definition.4.2.1}{}}
\newlabel{definition_group_action@cref}{{[definition][1][4,2]4.2.1}{[1][46][]46}}
\FN@pp@footnote@aux{16}{47}
\FN@pp@footnote@aux{17}{48}
\FN@pp@footnote@aux{18}{48}
\newlabel{definition_tensor_product_scalar_multiplication}{{4.24}{49}{Modules, induced representations, and Frobenius reciprocity}{equation.4.2.24}{}}
\newlabel{definition_tensor_product_scalar_multiplication@cref}{{[equation][24][4]4.24}{[1][49][]49}}
\newlabel{definition_induced_module}{{4.2.7}{49}{Induced module}{definition.4.2.7}{}}
\newlabel{definition_induced_module@cref}{{[definition][7][4,2]4.2.7}{[1][49][]49}}
\newlabel{theorem_frobenius_reciprocity_character_relationship}{{4.2.1}{50}{Frobenius reciprocity for characters}{theorem.4.2.1}{}}
\newlabel{theorem_frobenius_reciprocity_character_relationship@cref}{{[theorem][1][4,2]4.2.1}{[1][50][]50}}
\newlabel{equation_frobenius_reciprocity_character_relationship}{{4.29}{50}{Frobenius reciprocity for characters}{equation.4.2.29}{}}
\newlabel{equation_frobenius_reciprocity_character_relationship@cref}{{[equation][29][4]4.29}{[1][50][]50}}
\@writefile{toc}{\contentsline {section}{\numberline {4.3}The construction}{51}{section.4.3}\protected@file@percent }
\newlabel{section_construction_derangements}{{4.3}{51}{The construction}{section.4.3}{}}
\newlabel{section_construction_derangements@cref}{{[section][3][4]4.3}{[1][51][]51}}
\FN@pp@footnote@aux{19}{52}
\newlabel{equation_generating_set_centralizer}{{4.38}{53}{The construction}{equation.4.3.38}{}}
\newlabel{equation_generating_set_centralizer@cref}{{[equation][38][4]4.38}{[1][52][]53}}
\newlabel{irrep_multiplicity_master_formula}{{4.48}{55}{The construction}{equation.4.3.48}{}}
\newlabel{irrep_multiplicity_master_formula@cref}{{[subequation][48][4]4.48}{[1][55][]55}}
\newlabel{equation_fixing_notation_direct_sum_adjoint_decomposition}{{4.49}{55}{The construction}{equation.4.3.49}{}}
\newlabel{equation_fixing_notation_direct_sum_adjoint_decomposition@cref}{{[equation][49][4]4.49}{[1][55][]55}}
\citation{sagan2013symmetric}
\citation{fulton2013representation}
\FN@pp@footnote@aux{20}{56}
\@writefile{lot}{\contentsline {table}{\numberline {4.1}{\ignorespaces Character table of $S_2$\relax }}{56}{table.caption.10}\protected@file@percent }
\newlabel{character_table_s2}{{4.1}{56}{Character table of $S_2$\relax }{table.caption.10}{}}
\newlabel{character_table_s2@cref}{{[table][1][4]4.1}{[1][56][]56}}
\@writefile{toc}{\contentsline {section}{\numberline {4.4}Examples for $k = 2,3,4$}{57}{section.4.4}\protected@file@percent }
\newlabel{section_construction_derangements_examples}{{4.4}{57}{Examples for $k = 2,3,4$}{section.4.4}{}}
\newlabel{section_construction_derangements_examples@cref}{{[section][4][4]4.4}{[1][57][]57}}
\@writefile{toc}{\contentsline {subsection}{\numberline {4.4.1}$k=2$}{57}{subsection.4.4.1}\protected@file@percent }
\@writefile{toc}{\contentsline {subsection}{\numberline {4.4.2}$k=3$}{58}{subsection.4.4.2}\protected@file@percent }
\@writefile{lot}{\contentsline {table}{\numberline {4.2}{\ignorespaces Character table of $S_3$\relax }}{58}{table.caption.11}\protected@file@percent }
\newlabel{character_table_s3}{{4.2}{58}{Character table of $S_3$\relax }{table.caption.11}{}}
\newlabel{character_table_s3@cref}{{[table][2][4]4.2}{[1][58][]58}}
\@writefile{toc}{\contentsline {subsection}{\numberline {4.4.3}$k=4$}{59}{subsection.4.4.3}\protected@file@percent }
\newlabel{section_character_decomposition_k4}{{4.4.3}{59}{$k=4$}{subsection.4.4.3}{}}
\newlabel{section_character_decomposition_k4@cref}{{[subsection][3][4,4]4.4.3}{[1][59][]59}}
\FN@pp@footnote@aux{21}{59}
\newlabel{equation_derangement_decomposition_k4}{{4.66}{60}{$k=4$}{equation.4.4.66}{}}
\newlabel{equation_derangement_decomposition_k4@cref}{{[equation][66][4]4.66}{[1][60][]60}}
\newlabel{character_table_s4}{{\caption@xref {character_table_s4}{ on input line 2691}}{60}{$k=4$}{table.caption.12}{}}
\newlabel{character_table_s4@cref}{{[subsection][3][4,4]4.4.3}{[1][60][]60}}
\@writefile{lot}{\contentsline {table}{\numberline {4.3}{\ignorespaces Character table of $S_4$\relax }}{60}{table.caption.12}\protected@file@percent }
\FN@pp@footnote@aux{22}{61}
\newlabel{equation_adjoint_color_singlet_space_decomposition_characters_final_k4}{{4.72}{61}{$k=4$}{equation.4.4.72}{}}
\newlabel{equation_adjoint_color_singlet_space_decomposition_characters_final_k4@cref}{{[equation][72][4]4.72}{[1][61][]61}}
\citation{edison2012symmetric}
\citation{Moerman2017JIMWLK}
\@writefile{toc}{\contentsline {section}{\numberline {4.5}Characters tell us which adjoint color structures are real or purely imaginary}{62}{section.4.5}\protected@file@percent }
\newlabel{section_characters_real_imaginary_color_structures}{{4.5}{62}{Characters tell us which adjoint color structures are real or purely imaginary}{section.4.5}{}}
\newlabel{section_characters_real_imaginary_color_structures@cref}{{[section][5][4]4.5}{[1][62][]62}}
\FN@pp@footnote@aux{23}{62}
\newlabel{r_written_as_transpositions}{{4.80}{63}{Characters tell us which adjoint color structures are real or purely imaginary}{equation.4.5.80}{}}
\newlabel{r_written_as_transpositions@cref}{{[equation][80][4]4.80}{[1][63][]63}}
\newlabel{real_imaginary_r_action_on_W}{{4.86}{65}{Characters tell us which adjoint color structures are real or purely imaginary}{equation.4.5.86}{}}
\newlabel{real_imaginary_r_action_on_W@cref}{{[equation][86][4]4.86}{[1][64][]65}}
\@writefile{toc}{\contentsline {subsection}{\numberline {4.5.1}Examples: real and purely imaginary irreducible modules for $k=2,3,4$}{66}{subsection.4.5.1}\protected@file@percent }
\@writefile{lot}{\contentsline {table}{\numberline {4.4}{\ignorespaces Character table of $S_3$\relax }}{67}{table.caption.14}\protected@file@percent }
\@writefile{lot}{\contentsline {table}{\numberline {4.5}{\ignorespaces Character table of $S_4$\relax }}{68}{table.caption.15}\protected@file@percent }
\citation{Moerman2017JIMWLK}
\@writefile{toc}{\contentsline {section}{\numberline {4.6}Summary of \Cref  *{chapter_basis_theory}}{69}{section.4.6}\protected@file@percent }
\FN@pp@footnotehinttrue 
\@writefile{toc}{\contentsline {chapter}{\numberline {5}A digression: bounding simple Wilson line operators}{71}{chapter.5}\protected@file@percent }
\@writefile{lof}{\addvspace {10\p@ }}
\@writefile{lot}{\addvspace {10\p@ }}
\newlabel{chapter_bounding_singlet_images}{{5}{71}{A digression: bounding simple Wilson line operators}{chapter.5}{}}
\newlabel{chapter_bounding_singlet_images@cref}{{[chapter][5][]5}{[1][71][]71}}
\@writefile{lof}{\contentsline {figure}{\numberline {5.1}{\ignorespaces Hypocycloids with $N_c$ cusps, circumscribed by the unit circle.\relax }}{71}{figure.caption.16}\protected@file@percent }
\newlabel{hypocycloid_dipole}{{5.1}{71}{Hypocycloids with $N_c$ cusps, circumscribed by the unit circle.\relax }{figure.caption.16}{}}
\newlabel{hypocycloid_dipole@cref}{{[figure][1][5]5.1}{[1][71][]71}}
\@writefile{lof}{\contentsline {subfigure}{\numberline{(a)}{\ignorespaces {$N_c = 3$}}}{71}{subfigure.1.1}\protected@file@percent }
\@writefile{lof}{\contentsline {subfigure}{\numberline{(b)}{\ignorespaces {$N_c = 4$}}}{71}{subfigure.1.2}\protected@file@percent }
\@writefile{lof}{\contentsline {subfigure}{\numberline{(c)}{\ignorespaces {$N_c = 7$}}}{71}{subfigure.1.3}\protected@file@percent }
\@writefile{lof}{\contentsline {subfigure}{\numberline{(d)}{\ignorespaces {$N_c = 12$}}}{71}{subfigure.1.4}\protected@file@percent }
\citation{kaiser}
\citation{cooper2007almost}
\citation{kaiser}
\@writefile{toc}{\contentsline {section}{\numberline {5.1}The image of the trace of $SU(n)$ matrices is the region bounded by the $n$-cusp hypocycloid}{72}{section.5.1}\protected@file@percent }
\newlabel{section_hypocycloid_dipole_proof}{{5.1}{72}{The image of the trace of $SU(n)$ matrices is the region bounded by the $n$-cusp hypocycloid}{section.5.1}{}}
\newlabel{section_hypocycloid_dipole_proof@cref}{{[section][1][5]5.1}{[1][72][]72}}
\citation{duke2012graphic,brumbaugh2013graphic,lappi2016jimwlk,burkhardt2016visual}
\citation{RobertBryant,GregEgan}
\citation{tu}
\citation{tu}
\newlabel{kaisercriticalconditions}{{5.4}{73}{The image of the trace of $SU(n)$ matrices is the region bounded by the $n$-cusp hypocycloid}{equation.5.1.4}{}}
\newlabel{kaisercriticalconditions@cref}{{[equation][4][5]5.4}{[1][72][]73}}
\newlabel{theorem_hypocycloid_main}{{5.1.1}{73}{}{theorem.5.1.1}{}}
\newlabel{theorem_hypocycloid_main@cref}{{[theorem][1][5,1]5.1.1}{[1][73][]73}}
\newlabel{hypocycloids_f_smooth}{{5.1.1}{73}{}{lemma.5.1.1}{}}
\newlabel{hypocycloids_f_smooth@cref}{{[lemma][1][5,1]5.1.1}{[1][73][]73}}
\citation{GregEgan}
\citation{RobertBryant}
\newlabel{criticalvalueboundarylemma}{{5.1.2}{74}{}{lemma.5.1.2}{}}
\newlabel{criticalvalueboundarylemma@cref}{{[lemma][2][5,1]5.1.2}{[1][74][]74}}
\FN@pp@footnote@aux{24}{74}
\FN@pp@footnote@aux{25}{74}
\newlabel{Jacobiancolumn}{{5.8}{74}{The image of the trace of $SU(n)$ matrices is the region bounded by the $n$-cusp hypocycloid}{equation.5.1.8}{}}
\newlabel{Jacobiancolumn@cref}{{[equation][8][5]5.8}{[1][74][]74}}
\newlabel{lemmarank0criticalvalues}{{5.1.3}{74}{}{lemma.5.1.3}{}}
\newlabel{lemmarank0criticalvalues@cref}{{[lemma][3][5,1]5.1.3}{[1][74][]74}}
\newlabel{hypocycloid_critical_points_theorem_1}{{5.1.2}{75}{}{theorem.5.1.2}{}}
\newlabel{hypocycloid_critical_points_theorem_1@cref}{{[theorem][2][5,1]5.1.2}{[1][74][]75}}
\@writefile{lof}{\contentsline {figure}{\numberline {5.2}{\ignorespaces Visualisation of the critical values of $f$ as derived in \Cref  {hypocycloid_critical_points_theorem_1}. For $n \geq 4$, there exist families of critical points that lie in the interior of the image of $f$.\relax }}{76}{figure.caption.17}\protected@file@percent }
\newlabel{hypocycloid_critical_values_f_all}{{5.2}{76}{Visualisation of the critical values of $f$ as derived in \Cref {hypocycloid_critical_points_theorem_1}. For $n \geq 4$, there exist families of critical points that lie in the interior of the image of $f$.\relax }{figure.caption.17}{}}
\newlabel{hypocycloid_critical_values_f_all@cref}{{[figure][2][5]5.2}{[1][75][]76}}
\@writefile{lof}{\contentsline {subfigure}{\numberline{(a)}{\ignorespaces {$n = 3$}}}{76}{subfigure.2.1}\protected@file@percent }
\@writefile{lof}{\contentsline {subfigure}{\numberline{(b)}{\ignorespaces {$n = 4$}}}{76}{subfigure.2.2}\protected@file@percent }
\@writefile{lof}{\contentsline {subfigure}{\numberline{(c)}{\ignorespaces {$n = 5$}}}{76}{subfigure.2.3}\protected@file@percent }
\@writefile{lof}{\contentsline {subfigure}{\numberline{(d)}{\ignorespaces {$n = 12$}}}{76}{subfigure.2.4}\protected@file@percent }
\FN@pp@footnote@aux{26}{76}
\citation{kaiser}
\@writefile{lof}{\contentsline {figure}{\numberline {5.3}{\ignorespaces The curves $g(\theta , p, 0), \tmspace  +\thinmuskip {.1667em} n = 5$ (blue) as the circles with radii $(n-p)/n, \tmspace  +\thinmuskip {.1667em} p =1, \dots  , n-1$ roll inside of the unit circle. These curves intersect the unit circle at the $n$-th roots of unity once each of the rolling circles has completed a full revolution.\relax }}{77}{figure.caption.18}\protected@file@percent }
\newlabel{hypocycloid_rolling_g_c0}{{5.3}{77}{The curves $g(\theta , p, 0), \, n = 5$ (blue) as the circles with radii $(n-p)/n, \, p =1, \dots , n-1$ roll inside of the unit circle. These curves intersect the unit circle at the $n$-th roots of unity once each of the rolling circles has completed a full revolution.\relax }{figure.caption.18}{}}
\newlabel{hypocycloid_rolling_g_c0@cref}{{[figure][3][5]5.3}{[1][76][]77}}
\@writefile{lof}{\contentsline {subfigure}{\numberline{(a)}{\ignorespaces {$\theta = 0$}}}{77}{subfigure.3.1}\protected@file@percent }
\@writefile{lof}{\contentsline {subfigure}{\numberline{(b)}{\ignorespaces {$\theta = \frac {2}{5} \frac {2\pi (n-p)}{n}$}}}{77}{subfigure.3.2}\protected@file@percent }
\@writefile{lof}{\contentsline {subfigure}{\numberline{(c)}{\ignorespaces {$\theta = \frac {7}{10} \frac {2\pi (n-p)}{n}$}}}{77}{subfigure.3.3}\protected@file@percent }
\@writefile{lof}{\contentsline {subfigure}{\numberline{(d)}{\ignorespaces {$\theta = \frac {2\pi (n-p)}{n}$}}}{77}{subfigure.3.4}\protected@file@percent }
\@writefile{lof}{\contentsline {figure}{\numberline {5.4}{\ignorespaces The curves $g(\theta , p, 0), \tmspace  +\thinmuskip {.1667em} n = 5$ are rotated as $c = 0, \dots  , n-1$ varies, generating all of the critical values of $f$. \relax }}{77}{figure.caption.19}\protected@file@percent }
\newlabel{hypocycloid_rotate}{{5.4}{77}{The curves $g(\theta , p, 0), \, n = 5$ are rotated as $c = 0, \dots , n-1$ varies, generating all of the critical values of $f$. \relax }{figure.caption.19}{}}
\newlabel{hypocycloid_rotate@cref}{{[figure][4][5]5.4}{[1][77][]77}}
\@writefile{lof}{\contentsline {subfigure}{\numberline{(a)}{\ignorespaces {$c = 0$}}}{77}{subfigure.4.1}\protected@file@percent }
\@writefile{lof}{\contentsline {subfigure}{\numberline{(b)}{\ignorespaces {$c = 1$}}}{77}{subfigure.4.2}\protected@file@percent }
\@writefile{lof}{\contentsline {subfigure}{\numberline{(c)}{\ignorespaces {$c = 2$}}}{77}{subfigure.4.3}\protected@file@percent }
\@writefile{lof}{\contentsline {subfigure}{\numberline{(d)}{\ignorespaces {$c = 3$}}}{77}{subfigure.4.4}\protected@file@percent }
\@writefile{lof}{\contentsline {subfigure}{\numberline{(e)}{\ignorespaces {$c = 4$}}}{77}{subfigure.4.5}\protected@file@percent }
\citation{mezzadri2006generate}
\@writefile{toc}{\contentsline {section}{\numberline {5.2}Bounds on $(q\bar {q})^2$}{78}{section.5.2}\protected@file@percent }
\newlabel{section_hypocycloid_bounding_qqbar_and_more}{{5.2}{78}{Bounds on $(q\Bar {q})^2$}{section.5.2}{}}
\newlabel{section_hypocycloid_bounding_qqbar_and_more@cref}{{[section][2][5]5.2}{[1][78][]78}}
\FN@pp@footnote@aux{27}{79}
\@writefile{lof}{\contentsline {figure}{\numberline {5.5}{\ignorespaces $\mathcal  {O}_{11}$ generated for 100,000 random $SU(n)$ matrices (first row). Using only diagonal $SU(n)$ matrices fills out the image more clearly (second row). The unit circle and the $n$-cusp hypocycloid are overlaid.\relax }}{79}{figure.caption.20}\protected@file@percent }
\newlabel{hypocycloid_random_o11}{{5.5}{79}{$\mathcal {O}_{11}$ generated for 100,000 random $SU(n)$ matrices (first row). Using only diagonal $SU(n)$ matrices fills out the image more clearly (second row). The unit circle and the $n$-cusp hypocycloid are overlaid.\relax }{figure.caption.20}{}}
\newlabel{hypocycloid_random_o11@cref}{{[figure][5][5]5.5}{[1][79][]79}}
\@writefile{lof}{\contentsline {subfigure}{\numberline{(a)}{\ignorespaces {$n = 3$}}}{79}{subfigure.5.1}\protected@file@percent }
\@writefile{lof}{\contentsline {subfigure}{\numberline{(b)}{\ignorespaces {$n = 4$}}}{79}{subfigure.5.2}\protected@file@percent }
\@writefile{lof}{\contentsline {subfigure}{\numberline{(c)}{\ignorespaces {$n = 5$}}}{79}{subfigure.5.3}\protected@file@percent }
\@writefile{lof}{\contentsline {subfigure}{\numberline{(d)}{\ignorespaces {$n = 3$}}}{79}{subfigure.5.4}\protected@file@percent }
\@writefile{lof}{\contentsline {subfigure}{\numberline{(e)}{\ignorespaces {$n = 4$}}}{79}{subfigure.5.5}\protected@file@percent }
\@writefile{lof}{\contentsline {subfigure}{\numberline{(f)}{\ignorespaces {$n = 5$}}}{79}{subfigure.5.6}\protected@file@percent }
\@writefile{lof}{\contentsline {figure}{\numberline {5.6}{\ignorespaces $\mathcal  {O}_{12}$ generated for 100,000 random $SU(n)$ matrices (first row). Using only diagonal $SU(n)$ matrices fills out the image more clearly (second row). The unit circle and the $n$-cusp hypocycloid are overlaid.\relax }}{80}{figure.caption.21}\protected@file@percent }
\newlabel{hypocycloid_random_o12}{{5.6}{80}{$\mathcal {O}_{12}$ generated for 100,000 random $SU(n)$ matrices (first row). Using only diagonal $SU(n)$ matrices fills out the image more clearly (second row). The unit circle and the $n$-cusp hypocycloid are overlaid.\relax }{figure.caption.21}{}}
\newlabel{hypocycloid_random_o12@cref}{{[figure][6][5]5.6}{[1][79][]80}}
\@writefile{lof}{\contentsline {subfigure}{\numberline{(a)}{\ignorespaces {$n = 3$}}}{80}{subfigure.6.1}\protected@file@percent }
\@writefile{lof}{\contentsline {subfigure}{\numberline{(b)}{\ignorespaces {$n = 4$}}}{80}{subfigure.6.2}\protected@file@percent }
\@writefile{lof}{\contentsline {subfigure}{\numberline{(c)}{\ignorespaces {$n = 5$}}}{80}{subfigure.6.3}\protected@file@percent }
\@writefile{lof}{\contentsline {subfigure}{\numberline{(d)}{\ignorespaces {$n = 3$}}}{80}{subfigure.6.4}\protected@file@percent }
\@writefile{lof}{\contentsline {subfigure}{\numberline{(e)}{\ignorespaces {$n = 4$}}}{80}{subfigure.6.5}\protected@file@percent }
\@writefile{lof}{\contentsline {subfigure}{\numberline{(f)}{\ignorespaces {$n = 5$}}}{80}{subfigure.6.6}\protected@file@percent }
\@writefile{lof}{\contentsline {figure}{\numberline {5.7}{\ignorespaces $\mathcal  {O}_{22}$ generated for 100,000 random $SU(n)$ matrices (first row). Using only diagonal $SU(n)$ matrices fills out the image more clearly (second row). The unit circle and the $n$-cusp hypocycloid are overlaid.\relax }}{80}{figure.caption.22}\protected@file@percent }
\newlabel{hypocycloid_random_o22}{{5.7}{80}{$\mathcal {O}_{22}$ generated for 100,000 random $SU(n)$ matrices (first row). Using only diagonal $SU(n)$ matrices fills out the image more clearly (second row). The unit circle and the $n$-cusp hypocycloid are overlaid.\relax }{figure.caption.22}{}}
\newlabel{hypocycloid_random_o22@cref}{{[figure][7][5]5.7}{[1][79][]80}}
\@writefile{lof}{\contentsline {subfigure}{\numberline{(a)}{\ignorespaces {$n = 3$}}}{80}{subfigure.7.1}\protected@file@percent }
\@writefile{lof}{\contentsline {subfigure}{\numberline{(b)}{\ignorespaces {$n = 4$}}}{80}{subfigure.7.2}\protected@file@percent }
\@writefile{lof}{\contentsline {subfigure}{\numberline{(c)}{\ignorespaces {$n = 5$}}}{80}{subfigure.7.3}\protected@file@percent }
\@writefile{lof}{\contentsline {subfigure}{\numberline{(d)}{\ignorespaces {$n = 3$}}}{80}{subfigure.7.4}\protected@file@percent }
\@writefile{lof}{\contentsline {subfigure}{\numberline{(e)}{\ignorespaces {$n = 4$}}}{80}{subfigure.7.5}\protected@file@percent }
\@writefile{lof}{\contentsline {subfigure}{\numberline{(f)}{\ignorespaces {$n = 5$}}}{80}{subfigure.7.6}\protected@file@percent }
\newlabel{hypocycloid_o12_unit_circle}{{5.2.1}{81}{}{proposition.5.2.1}{}}
\newlabel{hypocycloid_o12_unit_circle@cref}{{[proposition][1][5,2]5.2.1}{[1][81][]81}}
\newlabel{hypocycloid_o22_unit_circle}{{5.2.2}{81}{}{proposition.5.2.2}{}}
\newlabel{hypocycloid_o22_unit_circle@cref}{{[proposition][2][5,2]5.2.2}{[1][81][]81}}
\@writefile{toc}{\contentsline {section}{\numberline {5.3}Concluding remarks on bounding these operators}{82}{section.5.3}\protected@file@percent }
\FN@pp@footnotehinttrue 
\citation{Moerman2017JIMWLK}
\citation{alcock2017compact,alcock2017transition,alcock2017simplification}
\citation{keppeler2012orthogonal}
\@writefile{toc}{\contentsline {chapter}{\numberline {6}Conclusions and outlook}{83}{chapter.6}\protected@file@percent }
\@writefile{lof}{\addvspace {10\p@ }}
\@writefile{lot}{\addvspace {10\p@ }}
\@writefile{toc}{\contentsline {section}{\numberline {6.1}New results established in this dissertation}{84}{section.6.1}\protected@file@percent }
\citation{Moerman2017JIMWLK}
\citation{WeigertConvo2017}
\citation{white2016introduction,vladimirov2015exponentiation,harley2015multiple,falcioni2014multiple}
\citation{blanes2009magnus}
\citation{keppeler2012orthogonal}
\@writefile{toc}{\contentsline {section}{\numberline {6.2}Open questions for future research}{85}{section.6.2}\protected@file@percent }
\FN@pp@footnotehinttrue 
\citation{cvitanovic2008group}
\@writefile{toc}{\contentsline {chapter}{\numberline {A}Birdtracks for our purposes}{87}{appendix.A}\protected@file@percent }
\@writefile{lof}{\addvspace {10\p@ }}
\@writefile{lot}{\addvspace {10\p@ }}
\newlabel{appendix_birdtracks}{{A}{87}{Birdtracks for our purposes}{appendix.A}{}}
\newlabel{appendix_birdtracks@cref}{{[appendix][1][2147483647]A}{[1][87][]87}}
\FN@pp@footnotehinttrue 
\@writefile{toc}{\contentsline {chapter}{\numberline {B}Proofs and calculations encountered in constructing the adjoint color structures}{89}{appendix.B}\protected@file@percent }
\@writefile{lof}{\addvspace {10\p@ }}
\@writefile{lot}{\addvspace {10\p@ }}
\@writefile{toc}{\contentsline {section}{\numberline {B.1}Intermediate steps in calculating the adjoint color structures, $k=4$}{89}{section.B.1}\protected@file@percent }
\newlabel{appendix_calculations_fourth_order}{{B.1}{89}{Intermediate steps in calculating the adjoint color structures, $k=4$}{section.B.1}{}}
\newlabel{appendix_calculations_fourth_order@cref}{{[subappendix][1][2147483647,2]B.1}{[1][89][]89}}
\@writefile{toc}{\contentsline {section}{\numberline {B.2}Deriving Frobenius reciprocity for characters}{94}{section.B.2}\protected@file@percent }
\newlabel{appendix_Frobenius_reciprocity}{{B.2}{94}{Deriving Frobenius reciprocity for characters}{section.B.2}{}}
\newlabel{appendix_Frobenius_reciprocity@cref}{{[subappendix][2][2147483647,2]B.2}{[1][94][]94}}
\newlabel{definition_tensor_hom_adjunction}{{B.2.1}{94}{Tensor-Hom adjunction}{proposition.B.2.1}{}}
\newlabel{definition_tensor_hom_adjunction@cref}{{[proposition][1][2147483647,2,2]B.2.1}{[1][94][]94}}
\citation{bourbaki1998algebra}
\citation{alperin1995groups}
\newlabel{definition_hom_isomorphism}{{B.13}{95}{Deriving Frobenius reciprocity for characters}{equation.B.2.13}{}}
\newlabel{definition_hom_isomorphism@cref}{{[equation][13][2147483647,2]B.13}{[1][95][]95}}
\newlabel{definition_Frobenius_reciprocity_isomorphism}{{B.2.1}{95}{Frobenius reciprocity}{theorem.B.2.1}{}}
\newlabel{definition_Frobenius_reciprocity_isomorphism@cref}{{[theorem][1][2147483647,2,2]B.2.1}{[1][95][]95}}
\newlabel{definition_hom_inner_product}{{B.2.2}{95}{}{theorem.B.2.2}{}}
\newlabel{definition_hom_inner_product@cref}{{[theorem][2][2147483647,2,2]B.2.2}{[1][95][]95}}
\newlabel{definition_appendix_frobenius_reciprocity_character_relationship}{{B.18}{96}{Deriving Frobenius reciprocity for characters}{equation.B.2.18}{}}
\newlabel{definition_appendix_frobenius_reciprocity_character_relationship@cref}{{[equation][18][2147483647,2]B.18}{[1][96][]96}}
\@writefile{toc}{\contentsline {section}{\numberline {B.3}A Proof that $r_{\mu } \in N_{S_k}(C_{S_k}(\sigma _{\mu }))$}{97}{section.B.3}\protected@file@percent }
\newlabel{appendix_normalizer_of_centralizer}{{B.3}{97}{A Proof that $r_{\mu } \in N_{S_k}(C_{S_k}(\sigma _{\mu }))$}{section.B.3}{}}
\newlabel{appendix_normalizer_of_centralizer@cref}{{[subappendix][3][2147483647,2]B.3}{[1][97][]97}}
\FN@pp@footnotehinttrue 
\citation{tu}
\@writefile{toc}{\contentsline {chapter}{\numberline {C}Proofs necessary for bounding the images of simple Wilson line correlators}{99}{appendix.C}\protected@file@percent }
\@writefile{lof}{\addvspace {10\p@ }}
\@writefile{lot}{\addvspace {10\p@ }}
\newlabel{appendix_bounding_wilson_lines_proofs}{{C}{99}{Proofs necessary for bounding the images of simple Wilson line correlators}{appendix.C}{}}
\newlabel{appendix_bounding_wilson_lines_proofs@cref}{{[appendix][3][2147483647]C}{[1][99][]99}}
\@writefile{toc}{\contentsline {section}{\numberline {C.1}\Cref  {hypocycloids_f_smooth}}{99}{section.C.1}\protected@file@percent }
\newlabel{appendix_hypocycloids_f_smooth}{{C.1}{99}{\Cref {hypocycloids_f_smooth}}{section.C.1}{}}
\newlabel{appendix_hypocycloids_f_smooth@cref}{{[subappendix][1][2147483647,3]C.1}{[1][99][]99}}
\newlabel{smoothnesscomponents}{{C.1.1}{99}{}{definition.C.1.1}{}}
\newlabel{smoothnesscomponents@cref}{{[definition][1][2147483647,3,1]C.1.1}{[1][99][]99}}
\citation{lee}
\@writefile{toc}{\contentsline {section}{\numberline {C.2}\Cref  {criticalvalueboundarylemma}}{100}{section.C.2}\protected@file@percent }
\newlabel{appendix_criticalvalueboundarylemma}{{C.2}{100}{\Cref {criticalvalueboundarylemma}}{section.C.2}{}}
\newlabel{appendix_criticalvalueboundarylemma@cref}{{[subappendix][2][2147483647,3]C.2}{[1][99][]100}}
\@writefile{toc}{\contentsline {section}{\numberline {C.3}\Cref  {lemmarank0criticalvalues}}{100}{section.C.3}\protected@file@percent }
\newlabel{appendix_lemmarank0criticalvalues}{{C.3}{100}{\Cref {lemmarank0criticalvalues}}{section.C.3}{}}
\newlabel{appendix_lemmarank0criticalvalues@cref}{{[subappendix][3][2147483647,3]C.3}{[1][100][]100}}
\@writefile{toc}{\contentsline {section}{\numberline {C.4}\Cref  {hypocycloid_critical_points_theorem_1}}{101}{section.C.4}\protected@file@percent }
\newlabel{appendix_hypocycloid_critical_points_theorem_1}{{C.4}{101}{\Cref {hypocycloid_critical_points_theorem_1}}{section.C.4}{}}
\newlabel{appendix_hypocycloid_critical_points_theorem_1@cref}{{[subappendix][4][2147483647,3]C.4}{[1][100][]101}}
\newlabel{identitysumsinusoids}{{C.9}{102}{\Cref {hypocycloid_critical_points_theorem_1}}{equation.C.4.9}{}}
\newlabel{identitysumsinusoids@cref}{{[subequation][9][2147483647,3]C.9}{[1][101][]102}}
\newlabel{hypocycloid_jacobian_determinant_condition}{{C.10c}{102}{\Cref {hypocycloid_critical_points_theorem_1}}{equation.C.4.10c}{}}
\newlabel{hypocycloid_jacobian_determinant_condition@cref}{{[subequation][3][2147483647,3,10]C.10c}{[1][102][]102}}
\newlabel{Jacobiandeterminantconditions}{{C.13}{102}{\Cref {hypocycloid_critical_points_theorem_1}}{equation.C.4.13}{}}
\newlabel{Jacobiandeterminantconditions@cref}{{[equation][13][2147483647,3]C.13}{[1][102][]102}}
\citation{GeoGebra}
\newlabel{thetaderivation}{{C.14b}{103}{\Cref {hypocycloid_critical_points_theorem_1}}{equation.C.4.14b}{}}
\newlabel{thetaderivation@cref}{{[subequation][2][2147483647,3,14]C.14b}{[1][103][]103}}
\newlabel{thetaconditionlast}{{C.14e}{103}{\Cref {hypocycloid_critical_points_theorem_1}}{equation.C.4.14e}{}}
\newlabel{thetaconditionlast@cref}{{[subequation][5][2147483647,3,14]C.14e}{[1][103][]103}}
\FN@pp@footnote@aux{28}{103}
\@writefile{lof}{\contentsline {figure}{\numberline {C.1}{\ignorespaces A circle of radius $r$ rolls inside of the unit circle. A point $P$ on the inner circle begins at $P_0$ and traces out a hypocycloid (blue) as $\theta $ varies. The arc length $1 \cdot \theta $ on the unit circle is equal to $r ( \theta + t)$ (orange).\relax }}{104}{figure.caption.23}\protected@file@percent }
\newlabel{hypocycloid_derive_diagram}{{C.1}{104}{A circle of radius $r$ rolls inside of the unit circle. A point $P$ on the inner circle begins at $P_0$ and traces out a hypocycloid (blue) as $\theta $ varies. The arc length $1 \cdot \theta $ on the unit circle is equal to $r ( \theta + t)$ (orange).\relax }{figure.caption.23}{}}
\newlabel{hypocycloid_derive_diagram@cref}{{[figure][1][2147483647,3]C.1}{[1][103][]104}}
\newlabel{hypocycloid_theta_t_relationship}{{C.18a}{104}{\Cref {hypocycloid_critical_points_theorem_1}}{equation.C.4.18a}{}}
\newlabel{hypocycloid_theta_t_relationship@cref}{{[subequation][1][2147483647,3,18]C.18a}{[1][104][]104}}
\newlabel{hypocycloid_derivation_shifted_arclength}{{C.21b}{105}{\Cref {hypocycloid_critical_points_theorem_1}}{equation.C.4.21b}{}}
\newlabel{hypocycloid_derivation_shifted_arclength@cref}{{[subequation][2][2147483647,3,21]C.21b}{[1][105][]105}}
\@writefile{toc}{\contentsline {section}{\numberline {C.5}\Cref  {hypocycloid_o12_unit_circle}}{106}{section.C.5}\protected@file@percent }
\newlabel{appendix_hypocycloid_o12_unit_circle}{{C.5}{106}{\Cref {hypocycloid_o12_unit_circle}}{section.C.5}{}}
\newlabel{appendix_hypocycloid_o12_unit_circle@cref}{{[subappendix][5][2147483647,3]C.5}{[1][105][]106}}
\@writefile{toc}{\contentsline {section}{\numberline {C.6}\Cref  {hypocycloid_o22_unit_circle}}{107}{section.C.6}\protected@file@percent }
\newlabel{appendix_hypocycloid_o22_unit_circle}{{C.6}{107}{\Cref {hypocycloid_o22_unit_circle}}{section.C.6}{}}
\newlabel{appendix_hypocycloid_o22_unit_circle@cref}{{[subappendix][6][2147483647,3]C.6}{[1][107][]107}}
\newlabel{equation_bounding_diagonal_22_intermediate_step}{{C.31}{107}{\Cref {hypocycloid_o22_unit_circle}}{equation.C.6.31}{}}
\newlabel{equation_bounding_diagonal_22_intermediate_step@cref}{{[equation][31][2147483647,3]C.31}{[1][107][]107}}
\newlabel{intermission}{{C.39j}{109}{\Cref {hypocycloid_o22_unit_circle}}{equation.C.6.39j}{}}
\newlabel{intermission@cref}{{[subequation][10][2147483647,3,39]C.39j}{[1][109][]109}}
\bibdata{JJR_MSc_bibliography}
\newlabel{maininequality}{{C.41}{110}{\Cref {hypocycloid_o22_unit_circle}}{equation.C.6.41}{}}
\newlabel{maininequality@cref}{{[subequation][41][2147483647,3]C.41}{[1][109][]110}}
\FN@pp@footnotehinttrue 
\bibcite{Moerman2017JIMWLK}{1}
\bibcite{alcock2017compact}{2}
\bibcite{alcock2017simplification}{3}
\bibcite{alcock2017transition}{4}
\bibcite{gribov1983semihard}{5}
\bibcite{mueller2002parton}{6}
\bibcite{jalilian2006saturation}{7}
\bibcite{iancu2002color}{8}
\bibcite{iancu2003color}{9}
\bibcite{weigert2005evolution}{10}
\bibcite{gelis2010color}{11}
\bibcite{kovchegov2012quantum}{12}
\bibcite{iancu2002geometric}{13}
\bibcite{kovchegov1999small}{14}
\bibcite{kovchegov2000unitarization}{15}
\@writefile{toc}{\contentsline {chapter}{Bibliography}{111}{appendix*.24}\protected@file@percent }
\bibcite{balitsky1996operator}{16}
\bibcite{balitsky1997operator}{17}
\bibcite{balitsky1999factorization}{18}
\bibcite{marquet2010new}{19}
\bibcite{kovchegov2009subleading}{20}
\bibcite{lappi2016jimwlk}{21}
\bibcite{keppeler2012orthogonal}{22}
\bibcite{edison2012symmetric}{23}
\bibcite{iancu2016cgc}{24}
\bibcite{weigert2002unitarity}{25}
\bibcite{rummukainen2004universal}{26}
\bibcite{jalilian1997intrinsic}{27}
\bibcite{keppeler2017birdtracks}{28}
\bibcite{stanley1996enumerative}{29}
\bibcite{rashid1973identity}{30}
\bibcite{sagan2013symmetric}{31}
\bibcite{keppeler2014hermitian}{32}
\bibcite{tung1985group}{33}
\bibcite{doty2004new}{34}
\bibcite{cvitanovic2008group}{35}
\bibcite{macfarlane1968gell}{36}
\bibcite{cvitanovic1976group}{37}
\bibcite{bishop1993group}{38}
\bibcite{wilson1955molecular}{39}
\bibcite{dresselhaus2007group}{40}
\bibcite{hall2015lie}{41}
\bibcite{cornwell1985group}{42}
\bibcite{serre2012linear}{43}
\bibcite{fulton2013representation}{44}
\bibcite{kaiser}{45}
\bibcite{cooper2007almost}{46}
\bibcite{duke2012graphic}{47}
\bibcite{brumbaugh2013graphic}{48}
\bibcite{burkhardt2016visual}{49}
\bibcite{RobertBryant}{50}
\bibcite{GregEgan}{51}
\bibcite{tu}{52}
\bibcite{mezzadri2006generate}{53}
\bibcite{WeigertConvo2017}{54}
\bibcite{white2016introduction}{55}
\bibcite{vladimirov2015exponentiation}{56}
\bibcite{harley2015multiple}{57}
\bibcite{falcioni2014multiple}{58}
\bibcite{blanes2009magnus}{59}
\bibcite{bourbaki1998algebra}{60}
\bibcite{alperin1995groups}{61}
\bibcite{lee}{62}
\bibcite{GeoGebra}{63}
\bibstyle{unsrt}
\FN@pp@footnotehinttrue 
