<?xml version="1.0" encoding="UTF-8" standalone="no"?>
<!-- Created with Inkscape (http://www.inkscape.org/) -->

<svg
   xmlns:osb="http://www.openswatchbook.org/uri/2009/osb"
   xmlns:dc="http://purl.org/dc/elements/1.1/"
   xmlns:cc="http://creativecommons.org/ns#"
   xmlns:rdf="http://www.w3.org/1999/02/22-rdf-syntax-ns#"
   xmlns:svg="http://www.w3.org/2000/svg"
   xmlns="http://www.w3.org/2000/svg"
   xmlns:xlink="http://www.w3.org/1999/xlink"
   xmlns:sodipodi="http://sodipodi.sourceforge.net/DTD/sodipodi-0.dtd"
   xmlns:inkscape="http://www.inkscape.org/namespaces/inkscape"
   sodipodi:docname="JIMWLK_gluon_emission_single.svg"
   inkscape:version="0.92.1 r15371"
   id="svg8"
   version="1.1"
   viewBox="0 0 210 297"
   height="297mm"
   width="210mm">
  <sodipodi:namedview
     inkscape:window-maximized="1"
     inkscape:window-y="-8"
     inkscape:window-x="-8"
     inkscape:window-height="1028"
     inkscape:window-width="1920"
     showgrid="false"
     inkscape:current-layer="layer1"
     inkscape:document-units="mm"
     inkscape:cy="658.8394"
     inkscape:cx="651.02367"
     inkscape:zoom="0.46622427"
     inkscape:pageshadow="2"
     inkscape:pageopacity="0.0"
     borderopacity="1.0"
     bordercolor="#666666"
     pagecolor="#ffffff"
     id="base"
     showguides="true"
     inkscape:measure-start="210.817,1240.63"
     inkscape:measure-end="249.099,1250.8"
     inkscape:guide-bbox="true">
    <sodipodi:guide
       position="-168.94086,150.08049"
       orientation="0,1"
       id="guide4578"
       inkscape:locked="false" />
    <sodipodi:guide
       position="104.73531,262.44021"
       orientation="1,0"
       id="guide4580"
       inkscape:locked="false" />
    <sodipodi:guide
       position="-122.39183,269.66333"
       orientation="0,1"
       id="guide4582"
       inkscape:locked="false" />
    <sodipodi:guide
       position="-53.77215,17.656528"
       orientation="0,1"
       id="guide4584"
       inkscape:locked="false" />
  </sodipodi:namedview>
  <defs
     id="defs2">
    <linearGradient
       inkscape:collect="always"
       id="linearGradient6361">
      <stop
         style="stop-color:#6d6eb1;stop-opacity:1"
         offset="0"
         id="stop6357" />
      <stop
         style="stop-color:#20203a;stop-opacity:1"
         offset="1"
         id="stop6359" />
    </linearGradient>
    <linearGradient
       inkscape:collect="always"
       id="linearGradient6339">
      <stop
         style="stop-color:#000000;stop-opacity:1"
         offset="0"
         id="stop6335" />
      <stop
         id="stop6343"
         offset="0.94908148"
         style="stop-color:#101010;stop-opacity:1" />
      <stop
         style="stop-color:#7d7777;stop-opacity:1"
         offset="1"
         id="stop6337" />
    </linearGradient>
    <linearGradient
       inkscape:collect="always"
       id="linearGradient6329">
      <stop
         style="stop-color:#000000;stop-opacity:1"
         offset="0"
         id="stop6325" />
      <stop
         id="stop6333"
         offset="0.10364477"
         style="stop-color:#0a0a0a;stop-opacity:1" />
      <stop
         style="stop-color:#7d7777;stop-opacity:1"
         offset="1"
         id="stop6327" />
    </linearGradient>
    <linearGradient
       inkscape:collect="always"
       id="linearGradient6305">
      <stop
         style="stop-color:#000075;stop-opacity:1"
         offset="0"
         id="stop6301" />
      <stop
         id="stop6313"
         offset="0.29886365"
         style="stop-color:#0000bb;stop-opacity:0.82352942" />
      <stop
         style="stop-color:#0000ff;stop-opacity:1"
         offset="0.89717048"
         id="stop6315" />
      <stop
         style="stop-color:#000081;stop-opacity:1"
         offset="1"
         id="stop6303" />
    </linearGradient>
    <linearGradient
       inkscape:collect="always"
       id="linearGradient6293">
      <stop
         style="stop-color:#727272;stop-opacity:1"
         offset="0"
         id="stop6289" />
      <stop
         id="stop6311"
         offset="0.04009727"
         style="stop-color:#d30000;stop-opacity:1" />
      <stop
         id="stop6309"
         offset="0.20670007"
         style="stop-color:#ee0000;stop-opacity:1" />
      <stop
         id="stop6299"
         offset="0.60268539"
         style="stop-color:#e70000;stop-opacity:1" />
      <stop
         id="stop6297"
         offset="0.93045026"
         style="stop-color:#ec0000;stop-opacity:1" />
      <stop
         style="stop-color:#ffdede;stop-opacity:1"
         offset="1"
         id="stop6291" />
    </linearGradient>
    <linearGradient
       inkscape:collect="always"
       id="linearGradient6277">
      <stop
         style="stop-color:#0b2228;stop-opacity:1;"
         offset="0"
         id="stop6273" />
      <stop
         id="stop6353"
         offset="0.5508365"
         style="stop-color:#6a6a6a;stop-opacity:1" />
      <stop
         style="stop-color:#626b6d;stop-opacity:0.50196081"
         offset="1"
         id="stop6275" />
    </linearGradient>
    <linearGradient
       inkscape:collect="always"
       id="linearGradient6265">
      <stop
         style="stop-color:#000000;stop-opacity:1;"
         offset="0"
         id="stop6261" />
      <stop
         id="stop6271"
         offset="0.96294039"
         style="stop-color:#010101;stop-opacity:1" />
      <stop
         style="stop-color:#626b6d;stop-opacity:0.50196081"
         offset="1"
         id="stop6263" />
    </linearGradient>
    <linearGradient
       inkscape:collect="always"
       id="linearGradient6235">
      <stop
         style="stop-color:#c5e8ff;stop-opacity:1"
         offset="0"
         id="stop6231" />
      <stop
         id="stop6239"
         offset="0.25614443"
         style="stop-color:#57b9ff;stop-opacity:1" />
      <stop
         style="stop-color:#00477a;stop-opacity:1"
         offset="1"
         id="stop6233" />
    </linearGradient>
    <linearGradient
       id="linearGradient3617"
       osb:paint="solid">
      <stop
         style="stop-color:#000000;stop-opacity:1;"
         offset="0"
         id="stop3615" />
    </linearGradient>
    <marker
       inkscape:stockid="Arrow1Lend"
       orient="auto"
       refY="0.0"
       refX="0.0"
       id="marker1199"
       style="overflow:visible;"
       inkscape:isstock="true">
      <path
         id="path869"
         d="M 0.0,0.0 L 5.0,-5.0 L -12.5,0.0 L 5.0,5.0 L 0.0,0.0 z "
         style="fill-rule:evenodd;stroke:#000000;stroke-width:1pt;stroke-opacity:1;fill:#000000;fill-opacity:1"
         transform="scale(0.8) rotate(180) translate(12.5,0)" />
    </marker>
    <marker
       inkscape:stockid="Arrow2Mend"
       orient="auto"
       refY="0.0"
       refX="0.0"
       id="Arrow2Mend"
       style="overflow:visible;"
       inkscape:isstock="true">
      <path
         id="path893"
         style="fill-rule:evenodd;stroke-width:0.625;stroke-linejoin:round;stroke:#000000;stroke-opacity:1;fill:#000000;fill-opacity:1"
         d="M 8.7185878,4.0337352 L -2.2072895,0.016013256 L 8.7185884,-4.0017078 C 6.9730900,-1.6296469 6.9831476,1.6157441 8.7185878,4.0337352 z "
         transform="scale(0.6) rotate(180) translate(0,0)" />
    </marker>
    <marker
       inkscape:stockid="Arrow2Lend"
       orient="auto"
       refY="0.0"
       refX="0.0"
       id="Arrow2Lend"
       style="overflow:visible;"
       inkscape:isstock="true">
      <path
         id="path887"
         style="fill-rule:evenodd;stroke-width:0.625;stroke-linejoin:round;stroke:#000000;stroke-opacity:1;fill:#000000;fill-opacity:1"
         d="M 8.7185878,4.0337352 L -2.2072895,0.016013256 L 8.7185884,-4.0017078 C 6.9730900,-1.6296469 6.9831476,1.6157441 8.7185878,4.0337352 z "
         transform="scale(1.1) rotate(180) translate(1,0)" />
    </marker>
    <inkscape:perspective
       sodipodi:type="inkscape:persp3d"
       inkscape:vp_x="526.89852 : 181.10575 : 1"
       inkscape:vp_y="0 : 1840.648 : 0"
       inkscape:vp_z="0.80417629 : 161.62556 : 1"
       inkscape:persp3d-origin="265.49809 : -14.225359 : 1"
       id="perspective8366" />
    <linearGradient
       id="linearGradient6875"
       osb:paint="solid">
      <stop
         style="stop-color:#000000;stop-opacity:1;"
         offset="0"
         id="stop6873" />
    </linearGradient>
    <linearGradient
       id="linearGradient6697"
       osb:paint="solid">
      <stop
         style="stop-color:#000000;stop-opacity:1;"
         offset="0"
         id="stop6695" />
    </linearGradient>
    <marker
       inkscape:stockid="Arrow1Lend"
       orient="auto"
       refY="0.0"
       refX="0.0"
       id="Arrow1Lend"
       style="overflow:visible;"
       inkscape:isstock="true">
      <path
         id="path820"
         d="M 0.0,0.0 L 5.0,-5.0 L -12.5,0.0 L 5.0,5.0 L 0.0,0.0 z "
         style="fill-rule:evenodd;stroke:#000000;stroke-width:1pt;stroke-opacity:1;fill:#000000;fill-opacity:1"
         transform="scale(0.8) rotate(180) translate(12.5,0)" />
    </marker>
    <radialGradient
       inkscape:collect="always"
       xlink:href="#linearGradient6235"
       id="radialGradient6237"
       cx="371.15912"
       cy="348.88168"
       fx="371.15912"
       fy="348.88168"
       r="55.668945"
       gradientTransform="matrix(1,0,0,5.7044119,0,-1598.2596)"
       gradientUnits="userSpaceOnUse" />
    <linearGradient
       inkscape:collect="always"
       xlink:href="#linearGradient6265"
       id="linearGradient6267"
       x1="35.15651"
       y1="85.412561"
       x2="99.599454"
       y2="85.412561"
       gradientUnits="userSpaceOnUse" />
    <linearGradient
       inkscape:collect="always"
       xlink:href="#linearGradient6277"
       id="linearGradient6279"
       x1="35.15651"
       y1="85.412561"
       x2="99.599454"
       y2="85.412561"
       gradientUnits="userSpaceOnUse" />
    <linearGradient
       inkscape:collect="always"
       xlink:href="#linearGradient6293"
       id="linearGradient6295"
       x1="57.189293"
       y1="85.498962"
       x2="99.1931"
       y2="104.26353"
       gradientUnits="userSpaceOnUse" />
    <linearGradient
       inkscape:collect="always"
       xlink:href="#linearGradient6305"
       id="linearGradient6307"
       x1="112.47185"
       y1="102.31124"
       x2="141.87923"
       y2="85.58564"
       gradientUnits="userSpaceOnUse" />
    <linearGradient
       inkscape:collect="always"
       xlink:href="#linearGradient6329"
       id="linearGradient6331"
       x1="112.46179"
       y1="85.41256"
       x2="177.23775"
       y2="85.412561"
       gradientUnits="userSpaceOnUse" />
    <linearGradient
       inkscape:collect="always"
       xlink:href="#linearGradient6339"
       id="linearGradient6341"
       x1="112.46179"
       y1="85.412561"
       x2="177.23775"
       y2="85.412561"
       gradientUnits="userSpaceOnUse" />
    <linearGradient
       inkscape:collect="always"
       xlink:href="#linearGradient6361"
       id="linearGradient6363"
       x1="110.92726"
       y1="89.888625"
       x2="112.4616"
       y2="89.888625"
       gradientUnits="userSpaceOnUse" />
  </defs>
  <metadata
     id="metadata5">
    <rdf:RDF>
      <cc:Work
         rdf:about="">
        <dc:format>image/svg+xml</dc:format>
        <dc:type
           rdf:resource="http://purl.org/dc/dcmitype/StillImage" />
        <dc:title />
      </cc:Work>
    </rdf:RDF>
  </metadata>
  <g
     inkscape:label="Layer 1"
     inkscape:groupmode="layer"
     id="layer1">
    <g
       sodipodi:type="inkscape:box3d"
       id="g8438"
       style="opacity:1;fill:none;fill-opacity:1;stroke:none;stroke-width:1.00157475;stroke-miterlimit:4;stroke-dasharray:none;stroke-opacity:1"
       inkscape:perspectiveID="#perspective8366"
       inkscape:corner0="-0.36601777 : 0.13631547 : 0 : 1"
       inkscape:corner7="-0.36938897 : 0.050073093 : 0.38533526 : 1"
       inkscape:transform-center-x="-11.532637"
       inkscape:transform-center-y="15.81614"
       transform="matrix(1.4365823,0,0,1.4980066,-46.976917,18.97093)">
      <path
         sodipodi:type="inkscape:box3dside"
         id="path8440"
         style="fill:#353564;fill-rule:evenodd;stroke:none;stroke-width:1.46152139;stroke-linejoin:round;stroke-opacity:1"
         inkscape:box3dsidetype="6"
         d="M 112.46162,6.180815 V 173.3286 L 82.520917,137.17999 V 33.21952 Z"
         points="112.46162,173.3286 82.520917,137.17999 82.520917,33.21952 112.46162,6.180815 " />
      <path
         sodipodi:type="inkscape:box3dside"
         id="path8448"
         style="fill:#afafde;fill-rule:evenodd;stroke:none;stroke-width:1.46152139;stroke-linejoin:round;stroke-opacity:1"
         inkscape:box3dsidetype="13"
         d="m 112.46162,173.3286 -1.53435,0.58072 -29.458089,-36.48882 1.051736,-0.24051 z"
         points="110.92727,173.90932 81.469181,137.4205 82.520917,137.17999 112.46162,173.3286 " />
      <path
         sodipodi:type="inkscape:box3dside"
         id="path8450"
         style="fill:#e9e9ff;fill-rule:evenodd;stroke:none;stroke-width:1.46152139;stroke-linejoin:round;stroke-opacity:1"
         inkscape:box3dsidetype="11"
         d="M 82.520917,33.21952 81.469181,33.115054 V 137.4205 l 1.051736,-0.24051 z"
         points="81.469181,33.115054 81.469181,137.4205 82.520917,137.17999 82.520917,33.21952 " />
      <path
         sodipodi:type="inkscape:box3dside"
         id="path8442"
         style="fill:#4d4d9f;fill-rule:evenodd;stroke:none;stroke-width:1.46152139;stroke-linejoin:round;stroke-opacity:1"
         inkscape:box3dsidetype="5"
         d="M 112.46162,6.180815 110.92727,5.8679676 81.469181,33.115054 82.520917,33.21952 Z"
         points="110.92727,5.8679676 81.469181,33.115054 82.520917,33.21952 112.46162,6.180815 " />
      <path
         sodipodi:type="inkscape:box3dside"
         id="path8444"
         style="fill:url(#linearGradient6363);fill-opacity:1;fill-rule:evenodd;stroke:none;stroke-width:1.46152139;stroke-linejoin:round;stroke-opacity:1"
         inkscape:box3dsidetype="3"
         d="M 112.46162,6.180815 110.92727,5.8679676 V 173.90932 l 1.53435,-0.58072 z"
         points="110.92727,5.8679676 110.92727,173.90932 112.46162,173.3286 112.46162,6.180815 " />
      <path
         style="fill:url(#radialGradient6237);fill-opacity:1;fill-rule:evenodd;stroke:none;stroke-width:5.52386045;stroke-linejoin:round;stroke-opacity:1"
         d="M 419.25195,22.177734 307.91406,125.16016 v 394.22461 l 111.33789,137.91015 z"
         id="path8446"
         transform="scale(0.26458333)"
         inkscape:connector-curvature="0" />
    </g>
    <path
       id="path1751"
       style="fill:none;fill-opacity:1;stroke:url(#linearGradient6307);stroke-width:0.5;stroke-linecap:butt;stroke-linejoin:miter;stroke-miterlimit:4;stroke-dasharray:none;stroke-opacity:1"
       d="m 140.89517,87.663963 c 1.14708,-0.949706 0.98406,-2.07832 0.98406,-2.07832 m -29.40738,16.725597 c 1.01087,0 1.38255,-0.37045 1.38255,-0.37045 m -0.66016,0.29467 c 0.54553,-0.14803 1.03317,-0.50882 1.35232,-1.00308 0.40834,-0.63229 0.53136,-1.463375 0.39334,-2.138401 -0.13802,-0.675004 -0.52728,-1.17122 -0.91105,-1.287522 -0.38377,-0.116321 -0.74231,0.151438 -0.8342,0.656247 -0.0919,0.504924 0.0936,1.228569 0.54973,1.818006 0.45614,0.58943 1.17424,1.02139 1.90586,1.07709 0.27677,0.0211 0.64833,-0.0418 0.90552,-0.13574 m 5.1e-4,0.001 c 0.53769,-0.1744 1.00722,-0.55849 1.30195,-1.06769 0.37711,-0.651416 0.45955,-1.487515 0.28886,-2.155038 -0.1707,-0.667501 -0.58364,-1.144201 -0.97262,-1.241699 -0.38898,-0.09752 -0.73408,0.187371 -0.80131,0.69606 -0.0672,0.508802 0.15327,1.222579 0.63753,1.789139 0.48428,0.566556 1.22255,0.963068 1.95603,0.983118 0.27747,0.008 0.63336,-0.0845 0.88606,-0.19 m 5.7e-4,10e-4 c 0.5293,-0.198442 0.98106,-0.603296 1.25257,-1.125258 0.34739,-0.667746 0.3991,-1.514179 0.17124,-2.164429 -0.22787,-0.650229 -0.6143,-1.118233 -1.00728,-1.198116 -0.39298,-0.0799 -0.72491,0.22024 -0.76916,0.731447 -0.0442,0.511318 0.20817,1.214453 0.71746,1.758639 0.50931,0.54418 1.33589,0.898908 2.06837,0.855364 0.27708,-0.01648 0.54594,-0.08696 0.79403,-0.202859 m 6.3e-4,0.0014 c 0.52059,-0.220309 0.9551,-0.643629 1.20464,-1.176451 0.31929,-0.681641 0.3263,-1.547697 0.0736,-2.188701 -0.25272,-0.640982 -0.72197,-1.0624 -1.12009,-1.110562 -0.39813,-0.04818 -0.64395,0.224651 -0.66687,0.737263 -0.0229,0.512722 0.25856,1.204745 0.79008,1.727256 0.53153,0.522505 1.35793,0.824659 2.08819,0.752952 0.27625,-0.02714 0.5422,-0.107912 0.78565,-0.233275 m 6.8e-4,0.0014 c 0.51172,-0.240185 0.98947,-0.708291 1.19889,-1.258133 0.26796,-0.703419 0.21548,-1.541968 -0.0599,-2.173578 -0.27537,-0.631589 -0.75933,-1.036045 -1.15891,-1.070011 -0.3996,-0.03398 -0.62919,0.272469 -0.63236,0.785589 -0.003,0.513228 0.30474,1.193911 0.85599,1.695581 0.55125,0.501663 1.37362,0.753248 2.10088,0.6556 0.27511,-0.03695 0.53801,-0.127138 0.77685,-0.261085 m 7.4e-4,0.0014 c 0.50285,-0.258244 0.94627,-0.763705 1.13748,-1.320144 0.24467,-0.711862 0.16462,-1.548235 -0.1314,-2.170445 -0.29601,-0.622188 -0.79302,-1.010501 -1.19351,-1.031298 -0.4005,-0.02081 -0.68432,0.325194 -0.65236,0.837336 0.032,0.512245 0.38576,1.170267 0.97006,1.633032 0.58432,0.462758 1.38515,0.709754 2.10881,0.588224 0.27374,-0.04598 0.58261,-0.184646 0.81249,-0.333455 m 8.2e-4,0.0013 c 0.48549,-0.289581 0.8579,-0.768469 1.03207,-1.330479 0.22287,-0.718988 0.10748,-1.584102 -0.23196,-2.183668 -0.33944,-0.599545 -0.86274,-0.951546 -1.26366,-0.943842 -0.40094,0.0077 -0.60032,0.313487 -0.55277,0.82442 0.0476,0.511035 0.42123,1.15798 1.01936,1.602734 0.59815,0.444745 1.45771,0.623746 2.17085,0.451131 0.26977,-0.06531 0.52187,-0.182297 0.7455,-0.340307 m 8.7e-4,0.0013 c 0.47329,-0.309036 0.82592,-0.802616 0.97711,-1.37119 0.19346,-0.72739 0.0567,-1.571094 -0.31143,-2.153524 -0.3681,-0.582409 -0.83653,-0.953489 -1.23746,-0.945785 -0.40094,0.0077 -0.65944,0.372955 -0.59119,0.881495 0.0683,0.508639 0.46789,1.139824 1.08354,1.559883 0.61566,0.420051 1.5071,0.577036 2.21106,0.370061 0.2663,-0.07831 0.51244,-0.207378 0.72815,-0.376043 m 9.4e-4,0.0012 c 0.45777,-0.331617 0.78607,-0.841718 0.90953,-1.416967 0.158,-0.735931 -0.0291,-1.581713 -0.42112,-2.14835 -0.392,-0.566615 -0.94486,-0.870142 -1.34349,-0.82641 -0.39864,0.04372 -0.57329,0.358544 -0.48048,0.863193 0.0929,0.504746 0.52258,1.115845 1.15789,1.505589 0.63531,0.389734 1.51358,0.496832 2.20834,0.26077 0.26281,-0.08931 0.50339,-0.228504 0.71191,-0.405993"
       inkscape:connector-curvature="0"
       transform="matrix(1.4365823,0,0,1.4980066,-46.976917,18.97093)" />
    <path
       id="path1803"
       style="fill:none;stroke:url(#linearGradient6295);stroke-width:0.5;stroke-linecap:butt;stroke-linejoin:miter;stroke-miterlimit:4;stroke-dasharray:none;stroke-opacity:1"
       d="m 58.05828,86.846782 c -0.780314,-0.727112 -0.868987,-1.34782 -0.868987,-1.34782 m 0.868987,1.34782 c 0.409221,0.38996 0.970454,0.620194 1.558561,0.637162 0.75239,0.02176 1.527025,-0.303531 2.032944,-0.771268 0.5059,-0.467729 0.728721,-1.057746 0.629407,-1.446267 -0.0993,-0.388536 -0.514072,-0.55653 -0.993486,-0.373633 -0.479495,0.182985 -1.002425,0.716494 -1.270348,1.412002 -0.267912,0.695519 -0.265419,1.533536 0.06593,2.188223 0.125352,0.247651 0.296971,0.466272 0.501999,0.647778 m -10e-4,0.0011 c 0.40922,0.389959 1.064921,0.639488 1.653191,0.629891 0.7526,-0.01223 1.511757,-0.37215 1.996045,-0.862245 0.484268,-0.490085 0.680227,-1.089555 0.563477,-1.473195 -0.116737,-0.383656 -0.538667,-0.532754 -1.009333,-0.328404 -0.470744,0.204442 -0.969055,0.761009 -1.205308,1.467898 -0.236242,0.706899 -0.195924,1.543944 0.164637,2.183003 0.136402,0.24174 0.317713,0.452389 0.530724,0.624455 m -9.83e-4,0.0012 c 0.426404,0.371088 1.09725,0.589411 1.68443,0.552395 0.751207,-0.04731 1.492752,-0.442232 1.953659,-0.954372 0.460887,-0.512129 0.62868,-1.120082 0.49417,-1.497858 -0.134498,-0.377793 -0.562919,-0.507055 -1.023543,-0.280983 -0.460696,0.226168 -0.932511,0.805361 -1.135546,1.522494 -0.203023,0.717141 -0.123719,1.551392 0.266244,2.17294 0.147525,0.235115 0.414788,0.499945 0.643104,0.65111 m -8.67e-4,0.0013 c 0.459558,0.329129 1.047387,0.478912 1.632112,0.413768 0.748069,-0.08329 1.469809,-0.513339 1.905611,-1.046999 0.435783,-0.533649 0.574215,-1.148948 0.421736,-1.519835 -0.152468,-0.370903 -0.586595,-0.479461 -1.035839,-0.23155 -0.449313,0.248009 -0.892795,0.849168 -1.061189,1.575212 -0.168381,0.726053 -0.04915,1.555533 0.370188,2.157653 0.158635,0.227766 0.447979,0.468953 0.683448,0.608711 m -8.03e-4,0.0013 c 0.475179,0.306139 1.069658,0.426845 1.650471,0.333036 0.743067,-0.119963 1.442791,-0.584966 1.851832,-1.139402 0.409022,-0.554423 0.51704,-1.17578 0.346514,-1.538721 -0.170515,-0.362958 -0.609452,-0.450045 -1.045965,-0.180352 -0.436576,0.269795 -0.849968,0.892025 -0.982468,1.625466 -0.132487,0.733449 0.08211,1.626671 0.559082,2.184234 0.180438,0.210909 0.398949,0.382655 0.641128,0.510432 m -7.36e-4,0.0014 c 0.489928,0.28193 1.089709,0.372679 1.665086,0.249871 0.736116,-0.157066 1.431283,-0.669816 1.782297,-1.262687 0.350997,-0.592856 0.467516,-1.168339 0.27901,-1.522273 -0.188497,-0.353952 -0.631246,-0.418922 -1.053688,-0.127685 -0.422499,0.291343 -0.804175,0.933513 -0.899737,1.672672 -0.09555,0.739166 0.175874,1.599195 0.680599,2.131763 0.190936,0.201455 0.417903,0.361859 0.666269,0.477147 m -6.67e-4,0.0014 c 0.503638,0.256634 1.186377,0.373887 1.7462,0.192957 0.716222,-0.231425 1.337201,-0.797301 1.657288,-1.407423 0.320071,-0.610108 0.332466,-1.240658 0.108798,-1.573487 -0.22366,-0.332848 -0.571469,-0.319717 -0.978542,-0.0074 -0.407127,0.312462 -0.755631,0.973221 -0.813457,1.716282 -0.05781,0.743069 0.269979,1.561328 0.801402,2.067259 0.201034,0.191373 0.435943,0.339903 0.689904,0.442283 m -5.94e-4,0.001 c 0.516158,0.23041 1.216771,0.28081 1.76651,0.0712 0.703322,-0.26808 1.294267,-0.865255 1.582436,-1.491085 0.288155,-0.625814 0.267988,-1.256163 0.02744,-1.577004 -0.240542,-0.320861 -0.688015,-0.317171 -1.060801,0.0354 -0.372826,0.352681 -0.651516,1.04578 -0.632606,1.790847 0.01892,0.745072 0.342205,1.518202 0.899032,1.996032 0.210644,0.18075 0.452905,0.31695 0.711812,0.40608 m -5.2e-4,0.001 c 0.527363,0.20347 1.241458,0.18163 1.779657,-0.056 0.688562,-0.304 1.247923,-0.93086 1.503435,-1.570719 0.255497,-0.639843 0.20285,-1.268313 -0.05393,-1.576323 -0.256769,-0.308028 -0.703457,-0.281267 -1.057564,0.09006 -0.354143,0.371439 -0.596718,1.077988 -0.539409,1.821092 0.05732,0.74311 0.420045,1.49853 1.000774,1.94701 0.219685,0.16964 0.575802,0.30101 0.842493,0.36308 m -3.69e-4,0.001 c 0.545471,0.14824 1.14863,0.0837 1.673941,-0.18126 0.672077,-0.3389 1.216629,-1.02262 1.405674,-1.68517 0.189034,-0.66254 0.07268,-1.282387 -0.214119,-1.562657 -0.286794,-0.28029 -0.622203,-0.214221 -0.956813,0.174767 -0.334639,0.389103 -0.540681,1.10716 -0.445358,1.84635 0.09534,0.73919 0.578468,1.49068 1.201838,1.87771 0.235815,0.1464 0.496063,0.24394 0.765558,0.29242 m -2.93e-4,0.002 c 0.552284,0.12041 1.244332,0.032 1.740391,-0.28438 0.634657,-0.40467 1.092759,-1.10893 1.248538,-1.78008 0.155768,-0.67114 0.0087,-1.28442 -0.291762,-1.550042 -0.300413,-0.265644 -0.737916,-0.171619 -1.031779,0.249002 -0.293881,0.42075 -0.426784,1.15587 -0.257722,1.88175 0.169078,0.72589 0.641905,1.41776 1.283798,1.77323 0.242822,0.13446 0.605775,0.24364 0.878738,0.26532 m -1.43e-4,0.002 c 0.561467,0.0654 1.1483,-0.0883 1.628329,-0.42842 0.61415,-0.43517 1.048356,-1.16538 1.138795,-1.84842 0.09043,-0.68302 -0.03268,-1.27381 -0.345708,-1.52445 -0.313023,-0.250668 -0.745418,-0.135399 -1.0184,0.29907 -0.272994,0.43459 -0.369856,1.17532 -0.165562,1.89209 0.20431,0.71678 0.787077,1.41294 1.460219,1.70496 0.254642,0.11045 0.526333,0.16902 0.80002,0.17769 m -6.9e-5,0.002 c 0.563944,0.0386 1.228474,-0.13093 1.674538,-0.51457 0.570701,-0.49077 0.924052,-1.25301 0.982851,-1.93951 0.05879,-0.68647 -0.174006,-1.27262 -0.509133,-1.49285 -0.335127,-0.22024 -0.661445,-0.0651 -0.913449,0.3819 -0.25201,0.44709 -0.313521,1.1916 -0.07535,1.89784 0.238182,0.70625 0.852173,1.32485 1.538086,1.58547 0.259473,0.0986 0.533581,0.14454 0.807377,0.14056"
       inkscape:connector-curvature="0"
       transform="matrix(1.4365823,0,0,1.4980066,-46.976917,18.97093)" />
    <path
       style="fill:url(#linearGradient6279);fill-opacity:1;stroke:url(#linearGradient6267);stroke-width:0.5;stroke-linecap:butt;stroke-linejoin:miter;stroke-miterlimit:4;stroke-dasharray:none;stroke-opacity:1"
       d="M 35.15651,85.412561 H 74.237673 99.599454"
       id="path6243"
       inkscape:connector-curvature="0"
       sodipodi:nodetypes="ccc"
       transform="matrix(1.4365823,0,0,1.4980066,-46.976917,18.97093)" />
    <path
       style="fill:url(#linearGradient6341);fill-opacity:1;stroke:#000000;stroke-width:0.5;stroke-linecap:butt;stroke-linejoin:miter;stroke-miterlimit:4;stroke-dasharray:none;stroke-opacity:1;marker-mid:url(#marker1199)"
       d="m 112.46179,85.412561 h 48.75999 16.01597"
       id="path42"
       inkscape:connector-curvature="0"
       transform="matrix(1.4365823,0,0,1.4980066,-46.976917,18.97093)" />
    <rect
       style="fill:#ffffff;stroke-width:0.5;stroke-miterlimit:4;stroke-dasharray:none"
       id="rect1797"
       width="2.8286443"
       height="1.2414112"
       x="60.156956"
       y="83.920609"
       transform="matrix(1.4365823,0,0,1.4980066,-46.976917,18.97093)" />
  </g>
</svg>
