{
    "onsubmit" : "return handle_post_request($(this),'/api/todos');",
    "method" : "post",
    "enctype" : "application/json",
    "html" :
    [
        {
            "type" : "p",
            "html" : "Create an awesome new task"
        },
        {
            "type" : "br"
        },
        {
            "name" : "task",
            "id" : "txt-task",
            "caption" : "what you have to do",
            "type" : "text"
        },
        {
            "type" : "submit",
            "value" : "submit"
        }
    ]
}