/* XPM */
static char * wall_xpm[] = {
"50 50 456 2",
"  	c #FFFFFF",
". 	c #F8F8F8",
"+ 	c #F0F0F0",
"@ 	c #E9E9E9",
"# 	c #E1E1E1",
"$ 	c #D8D8D8",
"% 	c #C6C6C6",
"& 	c #B1B1B1",
"* 	c #A5A5A5",
"= 	c #989898",
"- 	c #898989",
"; 	c #8A8989",
"> 	c #BCBCBC",
", 	c #787878",
"' 	c #474747",
") 	c #0D0000",
"! 	c #160000",
"~ 	c #220000",
"{ 	c #000000",
"] 	c #D3D3D3",
"^ 	c #AFAFAF",
"/ 	c #A0A0A0",
"( 	c #2E0000",
"_ 	c #380000",
": 	c #400100",
"< 	c #450300",
"[ 	c #420300",
"} 	c #260000",
"| 	c #1C0000",
"1 	c #CFCFCF",
"2 	c #818181",
"3 	c #2A2A2A",
"4 	c #3D0000",
"5 	c #480300",
"6 	c #540700",
"7 	c #5D0D00",
"8 	c #610F00",
"9 	c #630E00",
"0 	c #610C00",
"a 	c #4B0300",
"b 	c #636363",
"c 	c #A1A1A1",
"d 	c #AEAEAE",
"e 	c #858585",
"f 	c #353535",
"g 	c #350000",
"h 	c #490300",
"i 	c #580A00",
"j 	c #651100",
"k 	c #6F1700",
"l 	c #791D00",
"m 	c #7B1E00",
"n 	c #7C2000",
"o 	c #761A00",
"p 	c #701700",
"q 	c #640E00",
"r 	c #560700",
"s 	c #440100",
"t 	c #262626",
"u 	c #222222",
"v 	c #A6A6A6",
"w 	c #510500",
"x 	c #741900",
"y 	c #802400",
"z 	c #8B2900",
"A 	c #922F00",
"B 	c #943300",
"C 	c #943500",
"D 	c #953400",
"E 	c #912F00",
"F 	c #882900",
"G 	c #7F2200",
"H 	c #731900",
"I 	c #650F00",
"J 	c #4C0200",
"K 	c #691100",
"L 	c #7A1F00",
"M 	c #8A2A00",
"N 	c #9C3D00",
"O 	c #A24500",
"P 	c #A64900",
"Q 	c #A54A00",
"R 	c #A64700",
"S 	c #A34500",
"T 	c #9E3D00",
"U 	c #933400",
"V 	c #892800",
"W 	c #4C0500",
"X 	c #323232",
"Y 	c #2A0000",
"Z 	c #8A2B00",
"` 	c #993900",
" .	c #A34600",
"..	c #AB5300",
"+.	c #AF5E00",
"@.	c #B06500",
"#.	c #AF6800",
"$.	c #AD5C00",
"%.	c #AA5100",
"&.	c #A24300",
"*.	c #993800",
"=.	c #892900",
"-.	c #440300",
";.	c #5A0700",
">.	c #741C00",
",.	c #993A00",
"'.	c #A64A00",
").	c #AD5B00",
"!.	c #B16F00",
"~.	c #B48000",
"{.	c #B88A00",
"].	c #B88F00",
"^.	c #B68900",
"/.	c #B57F00",
"(.	c #B26D00",
"_.	c #AD5800",
":.	c #983800",
"<.	c #370000",
"[.	c #460300",
"}.	c #681100",
"|.	c #7F2300",
"1.	c #A34800",
"2.	c #B47600",
"3.	c #B89000",
"4.	c #C0A300",
"5.	c #C7AE02",
"6.	c #C9B103",
"7.	c #C6AC01",
"8.	c #C0A000",
"9.	c #B88C00",
"0.	c #B27100",
"a.	c #AE5800",
"b.	c #A44500",
"c.	c #933200",
"d.	c #721A00",
"e.	c #9E4000",
"f.	c #AB5400",
"g.	c #B27200",
"h.	c #B99100",
"i.	c #C6AE02",
"j.	c #D7C60F",
"k.	c #E2D424",
"l.	c #E4D72A",
"m.	c #E0D221",
"n.	c #D5C20E",
"o.	c #C4AB02",
"p.	c #B88D00",
"q.	c #B16E00",
"r.	c #AB5100",
"s.	c #550700",
"t.	c #7A1C00",
"u.	c #923200",
"v.	c #A44700",
"w.	c #B06400",
"x.	c #B78700",
"y.	c #C4A702",
"z.	c #D9C815",
"A.	c #ECE33F",
"B.	c #F4ED63",
"C.	c #F6EE6D",
"D.	c #F3ED5F",
"E.	c #EADF3C",
"F.	c #D6C410",
"G.	c #C1A401",
"H.	c #B58100",
"I.	c #AE5F00",
"J.	c #923100",
"K.	c #771B00",
"L.	c #5B0D00",
"M.	c #3D0100",
"N.	c #3F0300",
"O.	c #7E2000",
"P.	c #963600",
"Q.	c #A84E00",
"R.	c #B16D00",
"S.	c #BC9500",
"T.	c #CDB607",
"U.	c #E6DB30",
"V.	c #F6EE6C",
"W.	c #FBF28C",
"X.	c #FCF493",
"Y.	c #FAF28B",
"Z.	c #F4EC65",
"`.	c #E3D729",
" +	c #CBB205",
".+	c #B78E00",
"++	c #B06900",
"@+	c #A64B00",
"#+	c #7B2000",
"$+	c #630F00",
"%+	c #420100",
"&+	c #641100",
"*+	c #983900",
"=+	c #A95200",
"-+	c #B37300",
";+	c #BD9B00",
">+	c #D1C00B",
",+	c #ECE343",
"'+	c #F9F082",
")+	c #FEF49A",
"!+	c #FEF69F",
"~+	c #F7EF7B",
"{+	c #EADF3A",
"]+	c #CFBA08",
"^+	c #B26F00",
"/+	c #963800",
"(+	c #631200",
"_+	c #450100",
":+	c #7F2400",
"<+	c #A95000",
"[+	c #B37200",
"}+	c #BD9900",
"|+	c #D4BF0B",
"1+	c #EBE241",
"2+	c #F9EF80",
"3+	c #FEF399",
"4+	c #FEF59D",
"5+	c #FEF497",
"6+	c #F8F079",
"7+	c #EADF39",
"8+	c #D0BB08",
"9+	c #BB9500",
"0+	c #973700",
"a+	c #7D2200",
"b+	c #7D2300",
"c+	c #963700",
"d+	c #A84C00",
"e+	c #B26C00",
"f+	c #BB9200",
"g+	c #CBB405",
"h+	c #E4D72B",
"i+	c #F4ED65",
"j+	c #F9F187",
"k+	c #FBF38E",
"l+	c #FAF286",
"m+	c #F2EC5F",
"n+	c #E2D625",
"o+	c #C8B104",
"p+	c #7C1E00",
"q+	c #600C00",
"r+	c #FDFDFD",
"s+	c #3B0100",
"t+	c #590900",
"u+	c #761B00",
"v+	c #903100",
"w+	c #AF6100",
"x+	c #B68300",
"y+	c #D5C30F",
"z+	c #E8DD35",
"A+	c #F1EA57",
"B+	c #F3ED61",
"C+	c #F0E853",
"D+	c #E6DB2F",
"E+	c #D2C10B",
"F+	c #BFA000",
"G+	c #A14300",
"H+	c #8E3000",
"I+	c #751B00",
"J+	c #3B0000",
"K+	c #E5E5E5",
"L+	c #8F8F8F",
"M+	c #320000",
"N+	c #510800",
"O+	c #6C1500",
"P+	c #892A00",
"Q+	c #AB5200",
"R+	c #C2A701",
"S+	c #D1BE0A",
"T+	c #DBCB19",
"U+	c #DECF1F",
"V+	c #DBCB17",
"W+	c #C2A400",
"X+	c #B98700",
"Y+	c #B06A00",
"Z+	c #A84F00",
"`+	c #9A3C00",
" @	c #862800",
".@	c #6B1600",
"+@	c #959595",
"@@	c #D1D1D1",
"#@	c #6E6E6E",
"$@	c #0D0D0D",
"%@	c #600F00",
"&@	c #7D2000",
"*@	c #AD5A00",
"=@	c #B78B00",
"-@	c #BE9D00",
";@	c #C5A902",
">@	c #C7AC03",
",@	c #AD5600",
"'@	c #A04200",
")@	c #620F00",
"!@	c #101010",
"~@	c #090909",
"{@	c #350100",
"]@	c #4F0800",
"^@	c #6E1800",
"/@	c #852600",
"(@	c #953700",
"_@	c #A54800",
":@	c #AB5800",
"<@	c #B37A00",
"[@	c #B68600",
"}@	c #B68100",
"|@	c #B47900",
"1@	c #B16600",
"2@	c #AC5500",
"3@	c #953500",
"4@	c #832500",
"5@	c #010101",
"6@	c #070707",
"7@	c #3D0300",
"8@	c #A04100",
"9@	c #AB5900",
"0@	c #AD5E00",
"a@	c #AD6100",
"b@	c #A74B00",
"c@	c #9F4000",
"d@	c #1D1D1D",
"e@	c #404040",
"f@	c #5D1000",
"g@	c #822500",
"h@	c #8E2E00",
"i@	c #9D4000",
"j@	c #A14200",
"k@	c #A24400",
"l@	c #9C3E00",
"m@	c #8C2C00",
"n@	c #5F0D00",
"o@	c #9F9F9F",
"p@	c #EBEBEB",
"q@	c #EFEFEF",
"r@	c #580B00",
"s@	c #671400",
"t@	c #741B00",
"u@	c #882B00",
"v@	c #8C2B00",
"w@	c #8D2D00",
"x@	c #892B00",
"y@	c #580700",
"z@	c #4F0500",
"A@	c #590D00",
"B@	c #6E1500",
"C@	c #4B0500",
"D@	c #520700",
"E@	c #928E8E",
"F@	c #761D00",
"G@	c #872A00",
"H@	c #8B2E00",
"I@	c #866C6C",
"J@	c #DCD8D8",
"K@	c #540B00",
"L@	c #9C3F00",
"M@	c #A85600",
"N@	c #AC5E00",
"O@	c #A95400",
"P@	c #9D3E00",
"Q@	c #A97E79",
"R@	c #E5D9D8",
"S@	c #FFFDFD",
"T@	c #771D00",
"U@	c #9C4000",
"V@	c #B17200",
"W@	c #C19E04",
"X@	c #C8AD08",
"Y@	c #C09C03",
"Z@	c #B77834",
"`@	c #DBADA4",
" #	c #FDE9E8",
".#	c #FEF8F8",
"+#	c #560B00",
"@#	c #882E00",
"##	c #AA5A00",
"$#	c #C5A204",
"%#	c #E5D83A",
"&#	c #F0E65C",
"*#	c #E3D636",
"=#	c #CFAF53",
"-#	c #E8BCAA",
";#	c #FDE3DF",
">#	c #FEF4F4",
",#	c #903400",
"'#	c #AD6800",
")#	c #CFB911",
"!#	c #F4EB6B",
"~#	c #FCF394",
"{#	c #F2EA66",
"]#	c #DEC763",
"^#	c #F1CAB5",
"/#	c #FEE1DC",
"(#	c #FEF3F2",
"_#	c #020202",
":#	c #5A0A00",
"<#	c #8E3100",
"[#	c #AD6300",
"}#	c #CAB009",
"|#	c #EEE555",
"1#	c #F8F07E",
"2#	c #EEE454",
"3#	c #E4CE7E",
"4#	c #F9D3C2",
"5#	c #FDE1DD",
"6#	c #FEF4F3",
"7#	c #050505",
"8#	c #7E2500",
"9#	c #A44C00",
"0#	c #B88601",
"a#	c #CEB610",
"b#	c #D9C71F",
"c#	c #D9C14E",
"d#	c #EAC8A0",
"e#	c #FDD8CF",
"f#	c #FEE7E5",
"g#	c #FFF8F7",
"h#	c #0A0A0A",
"i#	c #601200",
"j#	c #8C2D00",
"k#	c #A64F00",
"l#	c #AF6D00",
"m#	c #B27800",
"n#	c #D1A27E",
"o#	c #F5CDC1",
"p#	c #FEE2DF",
"q#	c #FFF1F1",
"r#	c #FFFCFC",
"s#	c #0F0F0F",
"t#	c #030303",
"u#	c #370100",
"v#	c #661200",
"w#	c #832900",
"x#	c #953A00",
"y#	c #AA6652",
"z#	c #DDB6AF",
"A#	c #FDE4E2",
"B#	c #FEF0EF",
"C#	c #FFFAFA",
"D#	c #141414",
"E#	c #0B0B0B",
"F#	c #500700",
"G#	c #784642",
"H#	c #BFA6A5",
"I#	c #F2E2E1",
"J#	c #FEF5F5",
"K#	c #FEFBFB",
"L#	c #161616",
"M#	c #121212",
"N#	c #060606",
"O#	c #8D8888",
"P#	c #E2DFDF",
"Q#	c #FFFEFE",
"R#	c #151515",
"S#	c #272727",
"T#	c #3E3E3E",
"U#	c #929292",
"V#	c #BEBEBE",
"W#	c #E0E0E0",
"                                    . + @ # # # # @ + .                                             ",
"                            . @ $ % & * = - ; - - = * & % $ @ .                                     ",
"                        + $ > = , ' ) ! ~ ~ ~ ~ ~ ! ) { ' , = > $ +         + +                     ",
"                    ] ^ / , ' { ) ~ ( _ : < [ < : _ } | ) { { ' , * 1 +   # * 1                     ",
"                . # 2 3 { { { ! ( 4 5 6 7 8 9 0 7 6 a 4 } ! { { { { b c d e , $                     ",
"              + % - f { { { | g h i j k l m n m o p q r s g | { { { { t u { v .                     ",
"            @ & b { { { { | _ w 9 x y z A B C D E F G H I J _ | { { { { { { 2 @                     ",
"          @ * ' { { { { ! g w K L M C N O P Q R S T U V l j W g ! { { { { { X * @                   ",
"        @ * ' { { { { ) Y h 9 L Z `  ...+.@.#.@.$.%.&.*.=.l 8 -.Y ) { { { { { ' * @                 ",
"      @ * ' { { { { { | 4 ;.>.M ,.'.).!.~.{.].^./.(._.R :.V H r <.| { { { { { { ' * @               ",
"    + & ' { { { { { ) Y [.}.|.C 1.$.2.3.4.5.6.7.8.9.0.a.b.c.G q h Y ) { { { { { { ' & +             ",
"  . % b { { { { { { ! g r d.Z e.f.g.h.i.j.k.l.m.n.o.p.q.r.N F p s.g ! { { { { { { { b % .           ",
"  # - { { { { { { { | : 7 t.u.v.w.x.y.z.A.B.C.D.E.F.G.H.I.S J.K.L.M.| { { { { { { { { - #           ",
"+ & ' { { { { { { { ~ N.8 O.P.Q.R.S.T.U.V.W.X.Y.Z.`. +.+++@+C #+$+%+~ { { { { { { { { ' & +         ",
"1 b { { { { { { { { ~ [ &+y *+=+-+;+>+,+'+)+!+)+~+{+]+S.^+Q./+G (+_+~ { { { { { { { { { b 1         ",
"* { { { { { { { { { ~ < &+:+:.<+[+}+|+1+2+3+4+5+6+7+8+9+R.Q.0+a+9 _+~ { { { { { { { { { { * +       ",
", { { { { { { { { { ~ %+$+b+c+d+e+f+g+h+i+j+k+l+m+n+o+p.#.Q D p+q+M.~ { { { { { { { { { { , $     r+",
"' { { { { { { { { { | s+t+u+v+ .w+x+4.y+z+A+B+C+D+E+F+/.$.G+H+I+i J+| { { { { { { { { { { ' > . K+L+",
"{ { { { { { { { { { ) M+N+O+P+N Q+^+{.R+S+T+U+V+]+W+X+Y+Z+`+ @.@W M+) { { { { { { { { { { { +@@@#@$@",
"{ { { { { { { { { { { } [ %@&@c.S *@[+=@-@;@>@y.;+x.(.,@'@v+p+)@< } { { { { { { { { { { { { !@~@$@$@",
"{ { { { { { { { { { { ! {@]@^@/@(@_@:@++<@x+[@}@|@1@2@S 3@4@O+w g ! { { { { { { { { { { { { 5@6@$@$@",
"{ { { { { { { { { { { { } 7@L.x  @C 8@Q.9@0@a@$.:@b@c@D /@H 7 : ~ { { { { { { { { { { { { { { d@e@t ",
"{ { { { { { { { { { { { ) Y [ f@d.g@h@:.i@j@k@'@l@P.m@|.p n@< Y ) { { { { { { { { { { { { { { o@p@q@",
"{ { { { { { { { { { { { { ) ( < r@s@t@y u@v@w@x@ @G I+s@y@< ( ) { { { { { { { { { { { { { ) { = @   ",
"{ { { { { { { { { { { { { { ! Y M.z@A@j ^@d.H d.B@&+A@C@M.} ! { { { { { { { { { { { { { ) { { - #   ",
"{ { { { { { { { { { { { { { { ) ~ Y M.h W D@D@D@W h M.( | ) { { { { { { { { { { { ) ) { { { { - #   ",
"{ { { { { { { { { { { { { { { { { ) | } ( g g g ( ~ ! ) { { { { { { { { { { { { { { { { { { { - #   ",
"{ { { { { { { { { { { { { { { { { { { { ) ) ) ) ) { { { { { { { { { { { { { { { { { ) ! | ! ) - #   ",
"{ { { { { { { { { { { { { { { { { { { { { { { { { { { { { { { { { { { { { { { { { } [ 6 A@r N.E@@   ",
"{ { { { { { { { { { { { { { { { { { { { { { { { { { { { { { { { { { { { { { { { ( r@F@G@H@u@t@I@J@  ",
"{ { { { { { { { { { { { { { { { { { { { { { { { { { { { { { { { { { { { { { { | K@:+L@M@N@O@P@Q@R@S@",
"{ { { { { { { { { { { { { { { { { { { { { { { { { { { { { { { { { { { { { { ) < T@U@V@W@X@Y@Z@`@ #.#",
"{ { { { { { { { { { { { { { { { { { { { { { { { { { { { { { { { { { { { { { ! +#@###$#%#&#*#=#-#;#>#",
"{ { { { { { { { { { { { { { { { { { { { { { { { { { { { { { { { { { { { { { | L.,#'#)#!#~#{#]#^#/#(#",
"_#{ { { { { { { { { { { { { { { { { { { { { { { { { { { { { { { { { { { { { | :#<#[#}#|#1#2#3#4#5#6#",
"7#{ { { { { { { { { { { { { { { { { { { { { { { { { { { { { { { { { { { { { ) C@8#9#0#a#b#c#d#e#f#g#",
"h#{ { { { { { { { { { { { { { { { { { { { { { { { { { { { { { { { { { { { { { ( i#j#k#l#m#n#o#p#q#r#",
"s#t#{ { { { { { { { { { { { { { { { { { { { { { { { { { { { { { { { { { { { { ) u#v#w#x#y#z#A#B#C#  ",
"D#E#_#{ { { { { { { { { { { { { { { { { { { { { { { { { { { { { { { { { { { { { ) {@F#G#H#I#J#K#    ",
"L#M#N#{ { { { { { { { { { { { { { { { { { { { { { { { { { { { { { { { { { { { { { { ! O#P#S@Q#      ",
"L#R#S#T#{ { { { { { { { { { { { { { { { { { { { { { { { { { { { { { { { { { { { { { b % .           ",
"U#V#W#& ' { { { { { { { { { { { { { { { { { { { { { { { { { { { { { { { { { { { { ' & +             ",
"      @ * ' { { { { { { { { { { { { { { { { { { { { { { { { { { { { { { { { { { ' * @               ",
"        @ * ' { { { { { { { { { { { { { { { { { { { { { { { { { { { { { { { { ' * @                 ",
"          @ * ' { { { { { { { { { { { { { { { { { { { { { { { { { { { { { { ' * @                   ",
"            @ & b { { { { { { { { { { { { { { { { { { { { { { { { { { { { b & @                     ",
"              + % - ' { { { { { { { { { { { { { { { { { { { { { { { { ' - % +                       ",
"                . # & b { { { { { { { { { { { { { { { { { { { { { { b & # .                         ",
"                    + 1 * , ' { { { { { { { { { { { { { { { { ' , * 1 +                             ",
"                        + $ > = , ' { { { { { { { { { { ' , = > $ +                                 "};
