/* XPM */
static char * player_xpm[] = {
"50 50 194 2",
"  	c #FFFFFF",
". 	c #FEFFFE",
"+ 	c #F8FDF8",
"@ 	c #ECF9EE",
"# 	c #E5F7E6",
"$ 	c #E4F7E5",
"% 	c #EBF9EC",
"& 	c #F7FCF7",
"* 	c #F6FCF7",
"= 	c #E2F7E4",
"- 	c #C4EFC8",
"; 	c #A5E8AD",
"> 	c #94E59E",
", 	c #92E59B",
"' 	c #A1E7A9",
") 	c #BFEEC4",
"! 	c #DBF5DD",
"~ 	c #F0FAF1",
"{ 	c #FBFEFB",
"] 	c #FDFEFD",
"^ 	c #F0FBF1",
"/ 	c #CEF1D1",
"( 	c #9AE6A3",
"_ 	c #64DE76",
": 	c #3EDB5C",
"< 	c #2FDA54",
"[ 	c #2BDA52",
"} 	c #45DB60",
"| 	c #6ADF7A",
"1 	c #8DE497",
"2 	c #B4EBB9",
"3 	c #DDF5DF",
"4 	c #FCFEFD",
"5 	c #EAF9EB",
"6 	c #82E28E",
"7 	c #47DB61",
"8 	c #77E185",
"9 	c #ADEAB3",
"0 	c #A5E8AC",
"a 	c #7FE28C",
"b 	c #D5F3D7",
"c 	c #F4FCF5",
"d 	c #EDFAEE",
"e 	c #BDEDC2",
"f 	c #75E083",
"g 	c #3BDB5A",
"h 	c #32DA55",
"i 	c #CDF1D1",
"j 	c #C3EFC7",
"k 	c #56DD6C",
"l 	c #8BE396",
"m 	c #B5EBBB",
"n 	c #C7F0CB",
"o 	c #D3F3D6",
"p 	c #DEF5E0",
"q 	c #E6F8E8",
"r 	c #EEFAEF",
"s 	c #F7FDF8",
"t 	c #F3FBF3",
"u 	c #C9F0CD",
"v 	c #40DB5D",
"w 	c #61DE74",
"x 	c #8AE395",
"y 	c #83E28F",
"z 	c #58DD6D",
"A 	c #35DA57",
"B 	c #38DA58",
"C 	c #5DDD70",
"D 	c #89E394",
"E 	c #B1EBB7",
"F 	c #D7F4D9",
"G 	c #93E59D",
"H 	c #4BDC64",
"I 	c #71E080",
"J 	c #F1FBF2",
"K 	c #FCFEFC",
"L 	c #E5F7E7",
"M 	c #ABE9B1",
"N 	c #5BDD6F",
"O 	c #7CE189",
"P 	c #92E59C",
"Q 	c #B6ECBC",
"R 	c #CAF0CE",
"S 	c #E0F6E2",
"T 	c #F2FBF3",
"U 	c #C4EFC9",
"V 	c #7AE187",
"W 	c #66DE77",
"X 	c #A3E8AB",
"Y 	c #F3FBF4",
"Z 	c #F8FDF9",
"` 	c #F9FDF9",
" .	c #F3FCF4",
"..	c #D7F4DA",
"+.	c #98E6A1",
"@.	c #4DDC65",
"#.	c #F5FCF6",
"$.	c #D1F2D4",
"%.	c #9EE7A6",
"&.	c #68DF79",
"*.	c #27DA50",
"=.	c #49DC63",
"-.	c #C3EFC8",
";.	c #BBEDC0",
">.	c #ACEAB3",
",.	c #70E07F",
"'.	c #76E084",
").	c #E9F9EB",
"!.	c #CCF1CF",
"~.	c #C6EFCA",
"{.	c #BCEDC1",
"].	c #BAECBF",
"^.	c #B7ECBD",
"/.	c #ABE9B2",
"(.	c #86E392",
"_.	c #51DC68",
":.	c #E1F6E3",
"<.	c #D0F2D3",
"[.	c #CDF1D0",
"}.	c #C0EEC5",
"|.	c #84E290",
"1.	c #6CDF7C",
"2.	c #8EE498",
"3.	c #B0EAB6",
"4.	c #7DE18A",
"5.	c #6BDF7B",
"6.	c #CCF1D0",
"7.	c #CEF1D2",
"8.	c #C9F0CC",
"9.	c #4FDC67",
"0.	c #B6ECBB",
"a.	c #9FE7A7",
"b.	c #D9F4DC",
"c.	c #96E59F",
"d.	c #AEEAB4",
"e.	c #B2EBB8",
"f.	c #F2FBF2",
"g.	c #D8F4DA",
"h.	c #B9ECBE",
"i.	c #85E391",
"j.	c #63DE75",
"k.	c #80E28D",
"l.	c #E3F7E5",
"m.	c #B8ECBD",
"n.	c #7EE18B",
"o.	c #42DB5E",
"p.	c #B3EBB9",
"q.	c #9BE6A4",
"r.	c #E7F8E8",
"s.	c #C1EEC6",
"t.	c #E8F8EA",
"u.	c #E8F8E9",
"v.	c #C8F0CC",
"w.	c #8CE497",
"x.	c #A2E8AA",
"y.	c #A4E8AB",
"z.	c #5ADD6E",
"A.	c #ECF9ED",
"B.	c #D4F3D7",
"C.	c #99E6A2",
"D.	c #53DC69",
"E.	c #B8ECBE",
"F.	c #81E28D",
"G.	c #EFFAF0",
"H.	c #95E59E",
"I.	c #55DD6A",
"J.	c #C1EEC5",
"K.	c #7BE188",
"L.	c #6FDF7E",
"M.	c #D2F2D5",
"N.	c #99E6A1",
"O.	c #C5EFC9",
"P.	c #EDFAEF",
"Q.	c #C2EEC6",
"R.	c #BEEDC2",
"S.	c #A8E9AF",
"T.	c #5EDE72",
"U.	c #E2F6E4",
"V.	c #79E186",
"W.	c #67DE78",
"X.	c #FAFEFB",
"Y.	c #88E393",
"Z.	c #ADEAB4",
"`.	c #9CE6A4",
" +	c #CBF1CF",
".+	c #BEEEC3",
"++	c #9DE7A5",
"@+	c #AFEAB5",
"#+	c #A6E8AD",
"$+	c #87E393",
"%+	c #8FE499",
"&+	c #E9F8EA",
"*+	c #FAFDFA",
"=+	c #CFF2D2",
"                                                                                                    ",
"                                                                                                    ",
"                                                                                                    ",
"                                                                                                    ",
"                                                                                                    ",
"                                                                                                    ",
"                                                                                                    ",
"                                                  . + @ # $ % & .                                   ",
"                                              . * = - ; > , ' ) ! ~ {                               ",
"                                            ] ^ / ( _ : < [ } | 1 2 3 & .                           ",
"                                          4 5 ) 6 7 [ [ [ < 8 9 0 a ( b c 4 ] . .                   ",
"                                        ] d e f g [ [ [ [ h 1 i j a k l m n o p q r s ]             ",
"                                      . t u 6 v [ [ [ [ [ < w x y z A B } C f D ( E o t             ",
"                                      + F G H [ [ [ [ [ [ [ [ [ [ [ [ < A g v H I ' / J             ",
"                                    K L M N [ [ [ [ [ [ [ [ [ [ [ [ h z O P ; Q R S t K             ",
"                                    T U V B [ [ [ [ [ [ [ [ [ [ [ A W X i S 5 Y Z { .               ",
"                            ] { `  ...+.@.[ [ [ [ [ [ [ [ [ [ [ < N ; 3 & ] ] ]                     ",
"                      . K #.5 p $.) %.&.g [ *.*.*.*.*.*.*.*.*.[ =.> F * .                           ",
"                    K  .$ o R n -.;.>.P ,.=.< *.*.*.*.*.*.*.*.h '.- J .                             ",
"                . + ).F !.n ~.) ;.{.].^./.(._.[ *.*.*.*.*.*.*.H ' :.{                               ",
"              ] c S <.i [.}.; |.1.W ,.2.E 3.4.: *.*.*.*.*.*.*.5.}.J .                               ",
"            4 J ! 6.7.8.M 4.9.< *.*.*.v x 0.a.N *.*.*.*.*.*.*.6 o +                                 ",
"          4 ^ b.!.i }.c.N < *.*.*.*.*.*.5.d.e.f h *.*.*.*.*.*.2.3 {                                 ",
"        ] f.g.R / h.i.@.[ *.*.*.*.*.*.*.j.>.h.k.B *.*.*.*.*.*.c.l.4                                 ",
"      . c ! R 6.m.n.o.[ *.*.*.*.*.*.*.[ 1.p.].O A *.*.*.*.*.[ q.r.]                                 ",
"      s S R !.{.6 v [ [ [ [ [ [ [ [ [ B (.s.Q ,.< [ [ [ [ [ B ' t.]                                 ",
"    { u.6.v.) w.=.[ [ [ [ [ [ [ [ [ < k x.n y.z.[ [ [ [ [ [ @./.A..                                 ",
"  ] J B.n U C.D.< [ [ [ [ [ [ [ [ < =.y E.].F.: [ [ [ [ [ [ N 0.G..                                 ",
"  s p n n M _ < [ [ [ [ [ [ [ [ [ v V 3.e H.I.< [ [ [ [ [ [ 5.J.t                                   ",
"K 5 6.n h.K.A [ [ [ [ [ [ [ [ [ [ H ( 6.E.L.< [ [ [ [ [ [ < 6 M.+                                   ",
"c F ~.- N.@.[ [ [ [ [ [ [ [ [ [ [ o.( M.e 1.[ [ [ [ [ [ [ : C.:.K                                   ",
"# n O.3.&.< [ [ [ [ [ [ [ [ [ [ [ < 2.$.s.,.[ [ [ [ [ [ [ C 2 P..                                   ",
"o Q.R.x g [ [ [ [ [ [ [ [ [ [ [ [ [ l <.J.,.[ [ [ [ [ [ A n.[.*                                     ",
"~.j S.T.< [ [ [ [ [ [ [ [ [ [ [ [ B , 7.h.&.[ [ [ [ [ [ _.x.U.{                                     ",
"Q.R.(.B [ [ [ [ [ [ [ [ [ [ [ [ [ 9.x./ 9 C [ [ [ [ [ A V.~.f..                                     ",
"-./.T.[ [ [ [ [ [ [ [ [ [ [ [ [ < W.p.R ( @.[ [ [ [ [ k 0 :.X.                                      ",
"J.w.: [ [ [ [ [ [ [ [ [ [ [ [ [ v Y.j R.n.B [ [ [ [ g |.[.Y .                                       ",
"E W [ [ [ [ [ [ [ [ [ [ [ [ [ h W.Z.R 0 z.[ [ [ [ h W.e.u.K                                         ",
"> v [ [ [ [ [ [ [ [ [ [ [ [ < k +.n R.a g [ [ [ < k `.g.&                                           ",
"I < [ [ [ [ [ [ [ [ [ [ [ < @.w.Q.8.C.I.< [ [ [ H w. +^ ]                                           ",
"H [ [ [ [ [ [ [ [ [ [ [ < @.Y..+7.9 | h [ [ [ v n.}.% K                                             ",
"< [ [ [ [ [ [ [ [ [ [ h D.l e / e.'.: [ [ [ v '.^.q X.                                              ",
"[ [ [ [ [ [ [ [ [ [ A N , }./ E 8 v [ [ [ v '.p.U.`                                                 ",
"[ [ [ [ [ [ [ [ [ v 5.++- [.3.8 v [ [ [ v f 2 :.+ .                                                 ",
"*.*.*.*.*.*.[ A I.y @+u n #+I v *.*.[ =.O m U.+ .                                                   ",
"*.*.*.*.*.< 7 L.`.}.i ) c.w B *.*.< _.$+R.# Z .                                                     ",
"*.*.*.[ : j.%+2 R u @+y _.< *.*.h z.P ~.&+*+                                                        ",
"*.[ v _ x Z.U R {.N.| v [ *.[ o.1.' =+d X.                                                          ",
"} W l @+n 6..+' V 9.h *.*.< D.|.m ! T K                                                             ",
"G 3.O. +s.S.F.z A *.*.[ v | q.n q s .                                                               "};
