[
  {
    "id": 0,
    "title": "10x20mm Bolt",
    "description": "A common automotive bolt",
    "price": 0.50,
    "discounts": {
      "10": 10,
      "20": 20,
      "50": 30
    },
    "discountAsPercentage": true
  },
  {
    "id": 1,
    "title": "Flux Capacitor",
    "description": "A not so common time machine part",
    "price": 5000000,
    "discounts": {
      "5": 5000,
      "10": 10000,
      "20": 50000
    },
    "discountAsPercentage": false
  },
  {
    "id": 2,
    "title": "Expensive Item",
    "description": "An item that cannot be discounted, as it is so expensive for everyone involved.  Also Jeff Bezos' net worth",
    "price": 190700000000,
    "discounts": {},
    "discountAsPercentage": false
  },
  {
    "id": 3,
    "title": "Shrug",
    "description": "An item where questions about discounts are met with a shrug",
    "price": 444444,
    "discounts": null,
    "discountAsPercentage": false
  },
  {
    "id": 4,
    "title": "Houdini",
    "description": "An item where the discount literally doesn't exist",
    "price": 1874,
    "discountAsPercentage": false
  },
  {
    "id": 5,
    "title": "Subaru FA20 motor",
    "description": "A common, but moderately expensive automotive component",
    "price": 8000,
    "discounts": {
      "2": 100,
      "5": 200,
      "10": 500
    },
    "discountAsPercentage": false
  }
]
