{
    "definitions": {},
    "$schema": "http://json-schema.org/draft-07/schema",
    "type": "object",
    "title": "Payload for verify DNA",
    "required": [
        "dna"
    ],
    "properties": {
        "dna": {
            "type": "array",
            "title": "DNA array",
            "items": {
                "type": "string",
                "pattern": "\\b[TCACTG]+\\b(?![,])"
            }
        }
	}
}
