<?xml version="1.0" encoding="UTF-8" standalone="no"?>
<!DOCTYPE svg PUBLIC "-//W3C//DTD SVG 1.1//EN"
"http://www.w3.org/Graphics/SVG/1.1/DTD/svg11.dtd">
<svg version="1.1" xmlns="http://www.w3.org/2000/svg" xmlns:xlink="http://www.w3.org/1999/xlink">
<defs>
<style type="text/css"><![CDATA[
.g1_4{
fill: #EDDCE4;
}
.g2_4{
fill: none;
stroke: #6D1F48;
stroke-width: 1;
stroke-linecap: butt;
stroke-linejoin: miter;
}
.g3_4{
fill: none;
stroke: #000000;
stroke-width: 1;
stroke-linecap: butt;
stroke-linejoin: miter;
}
]]></style>
</defs>
<image x="109" y="72" width="210" height="60" xlink:href="img/1.png" />
<path d="M108,235l717,0l0,-61l-717,0l0,61Z" class="g1_4" />
<path d="M118,199l698,0l0,-25l-698,0l0,25Z" class="g1_4" />
<path d="M118,235l698,0l0,-36l-698,0l0,36Z" class="g1_4" />
<path d="M108.5,174.5l717,0" class="g2_4" />
<path d="M108,293l717,0l0,-57l-717,0l0,57Z" class="g1_4" />
<path d="M118,261l698,0l0,-25l-698,0l0,25Z" class="g1_4" />
<path d="M118,294l698,0l0,-33l-698,0l0,33Z" class="g1_4" />
<path d="M108.5,236.5l717,0" class="g2_4" />
<path d="M108.5,328.5l717,0" class="g3_4" />
<path d="M108.5,388.5l717,0" class="g3_4" />
<path d="M108.5,450.5l717,0" class="g3_4" />
<path d="M108.5,508.5l717,0" class="g3_4" />
<path d="M108.5,564.5l717,0" class="g3_4" />
<path d="M108,631l717,0l0,-36l-717,0l0,36Z" class="g1_4" />
<path d="M118,631l698,0l0,-36l-698,0l0,36Z" class="g1_4" />
<path d="M108.5,668.5l717,0" class="g3_4" />
<path d="M108.5,725.5l717,0" class="g3_4" />
<path d="M108,797l717,0l0,-36l-717,0l0,36Z" class="g1_4" />
<path d="M118,797l698,0l0,-36l-698,0l0,36Z" class="g1_4" />
<path d="M108.5,829.5l717,0" class="g3_4" />
<path d="M108.5,887.5l717,0" class="g3_4" />
<path d="M108.5,940.5l717,0" class="g3_4" />
<path d="M108.5,995.5l717,0" class="g3_4" />
<path d="M108.5,1053.5l717,0" class="g3_4" />
</svg>