%YAML 1.1
%TAG !u! tag:unity3d.com,2011:
--- !u!114 &11400000
MonoBehaviour:
  m_ObjectHideFlags: 0
  m_CorrespondingSourceObject: {fileID: 0}
  m_PrefabInstance: {fileID: 0}
  m_PrefabAsset: {fileID: 0}
  m_GameObject: {fileID: 0}
  m_Enabled: 1
  m_EditorHideFlags: 0
  m_Script: {fileID: 11500000, guid: 73e4d88f810540e7a3396c7a61786233, type: 3}
  m_Name: MrsClaus_Legs
  m_EditorClassIdentifier: 
  hipMain: {fileID: 2100000, guid: e8c37eed2fabf46b7a89810e84ae2fbf, type: 2}
  hipFront: {fileID: 2100000, guid: b71aa9e959323446088a0a80a107fa9f, type: 2}
  hipCrotch: {fileID: 2100000, guid: 130f58659a23b4041a03465b0b09614f, type: 2}
  legLeftMain: {fileID: 2100000, guid: d1bac3604f0c84cbfaa62db5cd165ae9, type: 2}
  legLeftFront: {fileID: 2100000, guid: 65defd6b719cd4d2cbce8a9df5d7ca80, type: 2}
  legLeftFoot: {fileID: 2100000, guid: 02adcbc4336154bd6b8980b3263db7b1, type: 2}
  legLeftSide: {fileID: 2100000, guid: ce72ae15641b047db840a79dd281777a, type: 2}
  legRightMain: {fileID: 2100000, guid: b7ccd953030504298b82b91c8d7dc682, type: 2}
  legRightFront: {fileID: 2100000, guid: 6f6dad160ad4942748be0850d4ec42d8, type: 2}
  legRightFoot: {fileID: 2100000, guid: 64943d4850f454cd0a2d1323606659cf, type: 2}
  legRightSide: {fileID: 2100000, guid: ada66f76e7ad540b6bb10a35877760e4, type: 2}
