%YAML 1.1
%TAG !u! tag:unity3d.com,2011:
--- !u!114 &11400000
MonoBehaviour:
  m_ObjectHideFlags: 0
  m_CorrespondingSourceObject: {fileID: 0}
  m_PrefabInstance: {fileID: 0}
  m_PrefabAsset: {fileID: 0}
  m_GameObject: {fileID: 0}
  m_Enabled: 1
  m_EditorHideFlags: 0
  m_Script: {fileID: 11500000, guid: a8953a30369a4c12a4f0fef378a14b63, type: 3}
  m_Name: Santa_Hat
  m_EditorClassIdentifier: 
  shells:
  - mesh: {fileID: 1429148786586207922, guid: 84a6ed21734d24c95a0250a56354d9ea, type: 3}
    material: {fileID: 2100000, guid: 7414c384adf544825a241be13046852d, type: 2}
  - mesh: {fileID: -4974468161004867859, guid: 84a6ed21734d24c95a0250a56354d9ea, type: 3}
    material: {fileID: 2100000, guid: 7ff40adab20f54dfaba8542ce7229970, type: 2}
