%YAML 1.1
%TAG !u! tag:unity3d.com,2011:
--- !u!114 &11400000
MonoBehaviour:
  m_ObjectHideFlags: 0
  m_CorrespondingSourceObject: {fileID: 0}
  m_PrefabInstance: {fileID: 0}
  m_PrefabAsset: {fileID: 0}
  m_GameObject: {fileID: 0}
  m_Enabled: 1
  m_EditorHideFlags: 0
  m_Script: {fileID: 11500000, guid: a8953a30369a4c12a4f0fef378a14b63, type: 3}
  m_Name: AstronautHat
  m_EditorClassIdentifier: 
  shells:
  - mesh: {fileID: -4974468161004867859, guid: 2c37fc2f835f24f8b96b0f8d5bbb09ff, type: 3}
    material: {fileID: 2100000, guid: ba518f2c0e9854fc399005788adb5e52, type: 2}
  - mesh: {fileID: -4974468161004867859, guid: 2c37fc2f835f24f8b96b0f8d5bbb09ff, type: 3}
    material: {fileID: 2100000, guid: ba518f2c0e9854fc399005788adb5e52, type: 2}
  - mesh: {fileID: -4974468161004867859, guid: 2c37fc2f835f24f8b96b0f8d5bbb09ff, type: 3}
    material: {fileID: 2100000, guid: ba518f2c0e9854fc399005788adb5e52, type: 2}
  - mesh: {fileID: -4974468161004867859, guid: 2c37fc2f835f24f8b96b0f8d5bbb09ff, type: 3}
    material: {fileID: 2100000, guid: ba518f2c0e9854fc399005788adb5e52, type: 2}
  - mesh: {fileID: -4974468161004867859, guid: 2c37fc2f835f24f8b96b0f8d5bbb09ff, type: 3}
    material: {fileID: 2100000, guid: ba518f2c0e9854fc399005788adb5e52, type: 2}
  - mesh: {fileID: -4974468161004867859, guid: 2c37fc2f835f24f8b96b0f8d5bbb09ff, type: 3}
    material: {fileID: 2100000, guid: ba518f2c0e9854fc399005788adb5e52, type: 2}
  - mesh: {fileID: -4974468161004867859, guid: 2c37fc2f835f24f8b96b0f8d5bbb09ff, type: 3}
    material: {fileID: 2100000, guid: ba518f2c0e9854fc399005788adb5e52, type: 2}
  - mesh: {fileID: -4974468161004867859, guid: 2c37fc2f835f24f8b96b0f8d5bbb09ff, type: 3}
    material: {fileID: 2100000, guid: ba518f2c0e9854fc399005788adb5e52, type: 2}
  - mesh: {fileID: -4974468161004867859, guid: 2c37fc2f835f24f8b96b0f8d5bbb09ff, type: 3}
    material: {fileID: 2100000, guid: ba518f2c0e9854fc399005788adb5e52, type: 2}
  - mesh: {fileID: -4974468161004867859, guid: 2c37fc2f835f24f8b96b0f8d5bbb09ff, type: 3}
    material: {fileID: 2100000, guid: ba518f2c0e9854fc399005788adb5e52, type: 2}
  - mesh: {fileID: -4974468161004867859, guid: 2c37fc2f835f24f8b96b0f8d5bbb09ff, type: 3}
    material: {fileID: 2100000, guid: ba518f2c0e9854fc399005788adb5e52, type: 2}
  - mesh: {fileID: -4974468161004867859, guid: 2c37fc2f835f24f8b96b0f8d5bbb09ff, type: 3}
    material: {fileID: 2100000, guid: ba518f2c0e9854fc399005788adb5e52, type: 2}
  - mesh: {fileID: -4974468161004867859, guid: 2c37fc2f835f24f8b96b0f8d5bbb09ff, type: 3}
    material: {fileID: 2100000, guid: ba518f2c0e9854fc399005788adb5e52, type: 2}
  - mesh: {fileID: -4974468161004867859, guid: 2c37fc2f835f24f8b96b0f8d5bbb09ff, type: 3}
    material: {fileID: 2100000, guid: ba518f2c0e9854fc399005788adb5e52, type: 2}
  - mesh: {fileID: -4974468161004867859, guid: 2c37fc2f835f24f8b96b0f8d5bbb09ff, type: 3}
    material: {fileID: 2100000, guid: ba518f2c0e9854fc399005788adb5e52, type: 2}
  - mesh: {fileID: -4974468161004867859, guid: 2c37fc2f835f24f8b96b0f8d5bbb09ff, type: 3}
    material: {fileID: 2100000, guid: ba518f2c0e9854fc399005788adb5e52, type: 2}
  - mesh: {fileID: -4974468161004867859, guid: 2c37fc2f835f24f8b96b0f8d5bbb09ff, type: 3}
    material: {fileID: 2100000, guid: ba518f2c0e9854fc399005788adb5e52, type: 2}
  - mesh: {fileID: -4974468161004867859, guid: 2c37fc2f835f24f8b96b0f8d5bbb09ff, type: 3}
    material: {fileID: 2100000, guid: ba518f2c0e9854fc399005788adb5e52, type: 2}
  - mesh: {fileID: -4974468161004867859, guid: 2c37fc2f835f24f8b96b0f8d5bbb09ff, type: 3}
    material: {fileID: 2100000, guid: ba518f2c0e9854fc399005788adb5e52, type: 2}
  - mesh: {fileID: -4974468161004867859, guid: 2c37fc2f835f24f8b96b0f8d5bbb09ff, type: 3}
    material: {fileID: 2100000, guid: ba518f2c0e9854fc399005788adb5e52, type: 2}
  - mesh: {fileID: -4974468161004867859, guid: 2c37fc2f835f24f8b96b0f8d5bbb09ff, type: 3}
    material: {fileID: 2100000, guid: ba518f2c0e9854fc399005788adb5e52, type: 2}
  - mesh: {fileID: -4974468161004867859, guid: 2c37fc2f835f24f8b96b0f8d5bbb09ff, type: 3}
    material: {fileID: 2100000, guid: ba518f2c0e9854fc399005788adb5e52, type: 2}
  - mesh: {fileID: -4974468161004867859, guid: 2c37fc2f835f24f8b96b0f8d5bbb09ff, type: 3}
    material: {fileID: 2100000, guid: ba518f2c0e9854fc399005788adb5e52, type: 2}
  - mesh: {fileID: -4974468161004867859, guid: 2c37fc2f835f24f8b96b0f8d5bbb09ff, type: 3}
    material: {fileID: 2100000, guid: ba518f2c0e9854fc399005788adb5e52, type: 2}
  - mesh: {fileID: -4974468161004867859, guid: 2c37fc2f835f24f8b96b0f8d5bbb09ff, type: 3}
    material: {fileID: 2100000, guid: ba518f2c0e9854fc399005788adb5e52, type: 2}
  - mesh: {fileID: -4974468161004867859, guid: 2c37fc2f835f24f8b96b0f8d5bbb09ff, type: 3}
    material: {fileID: 2100000, guid: ba518f2c0e9854fc399005788adb5e52, type: 2}
  - mesh: {fileID: -4974468161004867859, guid: 2c37fc2f835f24f8b96b0f8d5bbb09ff, type: 3}
    material: {fileID: 2100000, guid: ba518f2c0e9854fc399005788adb5e52, type: 2}
  - mesh: {fileID: -4974468161004867859, guid: 2c37fc2f835f24f8b96b0f8d5bbb09ff, type: 3}
    material: {fileID: 2100000, guid: ba518f2c0e9854fc399005788adb5e52, type: 2}
  - mesh: {fileID: -4974468161004867859, guid: 2c37fc2f835f24f8b96b0f8d5bbb09ff, type: 3}
    material: {fileID: 2100000, guid: ba518f2c0e9854fc399005788adb5e52, type: 2}
  - mesh: {fileID: -4974468161004867859, guid: 2c37fc2f835f24f8b96b0f8d5bbb09ff, type: 3}
    material: {fileID: 2100000, guid: ba518f2c0e9854fc399005788adb5e52, type: 2}
  - mesh: {fileID: -4974468161004867859, guid: 2c37fc2f835f24f8b96b0f8d5bbb09ff, type: 3}
    material: {fileID: 2100000, guid: ba518f2c0e9854fc399005788adb5e52, type: 2}
  - mesh: {fileID: -4974468161004867859, guid: 2c37fc2f835f24f8b96b0f8d5bbb09ff, type: 3}
    material: {fileID: 2100000, guid: ba518f2c0e9854fc399005788adb5e52, type: 2}
  - mesh: {fileID: -4974468161004867859, guid: 2c37fc2f835f24f8b96b0f8d5bbb09ff, type: 3}
    material: {fileID: 2100000, guid: ba518f2c0e9854fc399005788adb5e52, type: 2}
  - mesh: {fileID: -4974468161004867859, guid: 2c37fc2f835f24f8b96b0f8d5bbb09ff, type: 3}
    material: {fileID: 2100000, guid: ba518f2c0e9854fc399005788adb5e52, type: 2}
  - mesh: {fileID: -4974468161004867859, guid: 2c37fc2f835f24f8b96b0f8d5bbb09ff, type: 3}
    material: {fileID: 2100000, guid: ba518f2c0e9854fc399005788adb5e52, type: 2}
  - mesh: {fileID: -4974468161004867859, guid: 2c37fc2f835f24f8b96b0f8d5bbb09ff, type: 3}
    material: {fileID: 2100000, guid: ba518f2c0e9854fc399005788adb5e52, type: 2}
  - mesh: {fileID: -4974468161004867859, guid: 2c37fc2f835f24f8b96b0f8d5bbb09ff, type: 3}
    material: {fileID: 2100000, guid: ba518f2c0e9854fc399005788adb5e52, type: 2}
  - mesh: {fileID: -4974468161004867859, guid: 2c37fc2f835f24f8b96b0f8d5bbb09ff, type: 3}
    material: {fileID: 2100000, guid: ba518f2c0e9854fc399005788adb5e52, type: 2}
  - mesh: {fileID: -4974468161004867859, guid: 2c37fc2f835f24f8b96b0f8d5bbb09ff, type: 3}
    material: {fileID: 2100000, guid: ba518f2c0e9854fc399005788adb5e52, type: 2}
  - mesh: {fileID: -4974468161004867859, guid: 2c37fc2f835f24f8b96b0f8d5bbb09ff, type: 3}
    material: {fileID: 2100000, guid: ba518f2c0e9854fc399005788adb5e52, type: 2}
  - mesh: {fileID: -4974468161004867859, guid: 2c37fc2f835f24f8b96b0f8d5bbb09ff, type: 3}
    material: {fileID: 2100000, guid: ba518f2c0e9854fc399005788adb5e52, type: 2}
  - mesh: {fileID: -4974468161004867859, guid: 2c37fc2f835f24f8b96b0f8d5bbb09ff, type: 3}
    material: {fileID: 2100000, guid: ba518f2c0e9854fc399005788adb5e52, type: 2}
  - mesh: {fileID: -4974468161004867859, guid: 2c37fc2f835f24f8b96b0f8d5bbb09ff, type: 3}
    material: {fileID: 2100000, guid: ba518f2c0e9854fc399005788adb5e52, type: 2}
  - mesh: {fileID: -4974468161004867859, guid: 2c37fc2f835f24f8b96b0f8d5bbb09ff, type: 3}
    material: {fileID: 2100000, guid: ba518f2c0e9854fc399005788adb5e52, type: 2}
  - mesh: {fileID: -4974468161004867859, guid: 2c37fc2f835f24f8b96b0f8d5bbb09ff, type: 3}
    material: {fileID: 2100000, guid: ba518f2c0e9854fc399005788adb5e52, type: 2}
  - mesh: {fileID: -4974468161004867859, guid: 2c37fc2f835f24f8b96b0f8d5bbb09ff, type: 3}
    material: {fileID: 2100000, guid: ba518f2c0e9854fc399005788adb5e52, type: 2}
  - mesh: {fileID: -4974468161004867859, guid: 2c37fc2f835f24f8b96b0f8d5bbb09ff, type: 3}
    material: {fileID: 2100000, guid: ba518f2c0e9854fc399005788adb5e52, type: 2}
  - mesh: {fileID: -4974468161004867859, guid: 2c37fc2f835f24f8b96b0f8d5bbb09ff, type: 3}
    material: {fileID: 2100000, guid: ba518f2c0e9854fc399005788adb5e52, type: 2}
  - mesh: {fileID: -4974468161004867859, guid: 2c37fc2f835f24f8b96b0f8d5bbb09ff, type: 3}
    material: {fileID: 2100000, guid: ba518f2c0e9854fc399005788adb5e52, type: 2}
  - mesh: {fileID: -4974468161004867859, guid: 2c37fc2f835f24f8b96b0f8d5bbb09ff, type: 3}
    material: {fileID: 2100000, guid: ba518f2c0e9854fc399005788adb5e52, type: 2}
  - mesh: {fileID: -4974468161004867859, guid: 2c37fc2f835f24f8b96b0f8d5bbb09ff, type: 3}
    material: {fileID: 2100000, guid: ba518f2c0e9854fc399005788adb5e52, type: 2}
  - mesh: {fileID: -4974468161004867859, guid: 2c37fc2f835f24f8b96b0f8d5bbb09ff, type: 3}
    material: {fileID: 2100000, guid: ba518f2c0e9854fc399005788adb5e52, type: 2}
  - mesh: {fileID: -4974468161004867859, guid: 2c37fc2f835f24f8b96b0f8d5bbb09ff, type: 3}
    material: {fileID: 2100000, guid: ba518f2c0e9854fc399005788adb5e52, type: 2}
  - mesh: {fileID: -4974468161004867859, guid: 2c37fc2f835f24f8b96b0f8d5bbb09ff, type: 3}
    material: {fileID: 2100000, guid: ba518f2c0e9854fc399005788adb5e52, type: 2}
  - mesh: {fileID: -4974468161004867859, guid: 2c37fc2f835f24f8b96b0f8d5bbb09ff, type: 3}
    material: {fileID: 2100000, guid: ba518f2c0e9854fc399005788adb5e52, type: 2}
  - mesh: {fileID: -4974468161004867859, guid: 2c37fc2f835f24f8b96b0f8d5bbb09ff, type: 3}
    material: {fileID: 2100000, guid: ba518f2c0e9854fc399005788adb5e52, type: 2}
  - mesh: {fileID: -4974468161004867859, guid: 2c37fc2f835f24f8b96b0f8d5bbb09ff, type: 3}
    material: {fileID: 2100000, guid: ba518f2c0e9854fc399005788adb5e52, type: 2}
  - mesh: {fileID: -4974468161004867859, guid: 2c37fc2f835f24f8b96b0f8d5bbb09ff, type: 3}
    material: {fileID: 2100000, guid: ba518f2c0e9854fc399005788adb5e52, type: 2}
  - mesh: {fileID: -4974468161004867859, guid: 2c37fc2f835f24f8b96b0f8d5bbb09ff, type: 3}
    material: {fileID: 2100000, guid: ba518f2c0e9854fc399005788adb5e52, type: 2}
  - mesh: {fileID: -4974468161004867859, guid: 2c37fc2f835f24f8b96b0f8d5bbb09ff, type: 3}
    material: {fileID: 2100000, guid: ba518f2c0e9854fc399005788adb5e52, type: 2}
  - mesh: {fileID: -4974468161004867859, guid: 2c37fc2f835f24f8b96b0f8d5bbb09ff, type: 3}
    material: {fileID: 2100000, guid: ba518f2c0e9854fc399005788adb5e52, type: 2}
  - mesh: {fileID: -4974468161004867859, guid: 2c37fc2f835f24f8b96b0f8d5bbb09ff, type: 3}
    material: {fileID: 2100000, guid: ba518f2c0e9854fc399005788adb5e52, type: 2}
  - mesh: {fileID: -4974468161004867859, guid: 2c37fc2f835f24f8b96b0f8d5bbb09ff, type: 3}
    material: {fileID: 2100000, guid: ba518f2c0e9854fc399005788adb5e52, type: 2}
  - mesh: {fileID: -4974468161004867859, guid: 2c37fc2f835f24f8b96b0f8d5bbb09ff, type: 3}
    material: {fileID: 2100000, guid: ba518f2c0e9854fc399005788adb5e52, type: 2}
  - mesh: {fileID: -4974468161004867859, guid: 2c37fc2f835f24f8b96b0f8d5bbb09ff, type: 3}
    material: {fileID: 2100000, guid: ba518f2c0e9854fc399005788adb5e52, type: 2}
  - mesh: {fileID: -4974468161004867859, guid: 2c37fc2f835f24f8b96b0f8d5bbb09ff, type: 3}
    material: {fileID: 2100000, guid: ba518f2c0e9854fc399005788adb5e52, type: 2}
  - mesh: {fileID: -4974468161004867859, guid: 2c37fc2f835f24f8b96b0f8d5bbb09ff, type: 3}
    material: {fileID: 2100000, guid: ba518f2c0e9854fc399005788adb5e52, type: 2}
  - mesh: {fileID: -4974468161004867859, guid: 2c37fc2f835f24f8b96b0f8d5bbb09ff, type: 3}
    material: {fileID: 2100000, guid: ba518f2c0e9854fc399005788adb5e52, type: 2}
  - mesh: {fileID: -4974468161004867859, guid: 2c37fc2f835f24f8b96b0f8d5bbb09ff, type: 3}
    material: {fileID: 2100000, guid: ba518f2c0e9854fc399005788adb5e52, type: 2}
  - mesh: {fileID: -4974468161004867859, guid: 2c37fc2f835f24f8b96b0f8d5bbb09ff, type: 3}
    material: {fileID: 2100000, guid: ba518f2c0e9854fc399005788adb5e52, type: 2}
  - mesh: {fileID: -4974468161004867859, guid: 2c37fc2f835f24f8b96b0f8d5bbb09ff, type: 3}
    material: {fileID: 2100000, guid: ba518f2c0e9854fc399005788adb5e52, type: 2}
  - mesh: {fileID: -4974468161004867859, guid: 2c37fc2f835f24f8b96b0f8d5bbb09ff, type: 3}
    material: {fileID: 2100000, guid: ba518f2c0e9854fc399005788adb5e52, type: 2}
  - mesh: {fileID: -4974468161004867859, guid: 2c37fc2f835f24f8b96b0f8d5bbb09ff, type: 3}
    material: {fileID: 2100000, guid: ba518f2c0e9854fc399005788adb5e52, type: 2}
  - mesh: {fileID: -4974468161004867859, guid: 2c37fc2f835f24f8b96b0f8d5bbb09ff, type: 3}
    material: {fileID: 2100000, guid: ba518f2c0e9854fc399005788adb5e52, type: 2}
  - mesh: {fileID: -4974468161004867859, guid: 2c37fc2f835f24f8b96b0f8d5bbb09ff, type: 3}
    material: {fileID: 2100000, guid: ba518f2c0e9854fc399005788adb5e52, type: 2}
  - mesh: {fileID: -4974468161004867859, guid: 2c37fc2f835f24f8b96b0f8d5bbb09ff, type: 3}
    material: {fileID: 2100000, guid: ba518f2c0e9854fc399005788adb5e52, type: 2}
  - mesh: {fileID: -4974468161004867859, guid: 2c37fc2f835f24f8b96b0f8d5bbb09ff, type: 3}
    material: {fileID: 2100000, guid: ba518f2c0e9854fc399005788adb5e52, type: 2}
  - mesh: {fileID: -4974468161004867859, guid: 2c37fc2f835f24f8b96b0f8d5bbb09ff, type: 3}
    material: {fileID: 2100000, guid: ba518f2c0e9854fc399005788adb5e52, type: 2}
  - mesh: {fileID: -4974468161004867859, guid: 2c37fc2f835f24f8b96b0f8d5bbb09ff, type: 3}
    material: {fileID: 2100000, guid: ba518f2c0e9854fc399005788adb5e52, type: 2}
  - mesh: {fileID: -4974468161004867859, guid: 2c37fc2f835f24f8b96b0f8d5bbb09ff, type: 3}
    material: {fileID: 2100000, guid: ba518f2c0e9854fc399005788adb5e52, type: 2}
  - mesh: {fileID: -4974468161004867859, guid: 2c37fc2f835f24f8b96b0f8d5bbb09ff, type: 3}
    material: {fileID: 2100000, guid: ba518f2c0e9854fc399005788adb5e52, type: 2}
  - mesh: {fileID: -4974468161004867859, guid: 2c37fc2f835f24f8b96b0f8d5bbb09ff, type: 3}
    material: {fileID: 2100000, guid: ba518f2c0e9854fc399005788adb5e52, type: 2}
  - mesh: {fileID: -4974468161004867859, guid: 2c37fc2f835f24f8b96b0f8d5bbb09ff, type: 3}
    material: {fileID: 2100000, guid: ba518f2c0e9854fc399005788adb5e52, type: 2}
  - mesh: {fileID: -4974468161004867859, guid: 2c37fc2f835f24f8b96b0f8d5bbb09ff, type: 3}
    material: {fileID: 2100000, guid: ba518f2c0e9854fc399005788adb5e52, type: 2}
  - mesh: {fileID: -4974468161004867859, guid: 2c37fc2f835f24f8b96b0f8d5bbb09ff, type: 3}
    material: {fileID: 2100000, guid: ba518f2c0e9854fc399005788adb5e52, type: 2}
  - mesh: {fileID: -4974468161004867859, guid: 2c37fc2f835f24f8b96b0f8d5bbb09ff, type: 3}
    material: {fileID: 2100000, guid: ba518f2c0e9854fc399005788adb5e52, type: 2}
  - mesh: {fileID: -4974468161004867859, guid: 2c37fc2f835f24f8b96b0f8d5bbb09ff, type: 3}
    material: {fileID: 2100000, guid: ba518f2c0e9854fc399005788adb5e52, type: 2}
  - mesh: {fileID: -4974468161004867859, guid: 2c37fc2f835f24f8b96b0f8d5bbb09ff, type: 3}
    material: {fileID: 2100000, guid: ba518f2c0e9854fc399005788adb5e52, type: 2}
  - mesh: {fileID: -4974468161004867859, guid: 2c37fc2f835f24f8b96b0f8d5bbb09ff, type: 3}
    material: {fileID: 2100000, guid: ba518f2c0e9854fc399005788adb5e52, type: 2}
  - mesh: {fileID: -4974468161004867859, guid: 2c37fc2f835f24f8b96b0f8d5bbb09ff, type: 3}
    material: {fileID: 2100000, guid: ba518f2c0e9854fc399005788adb5e52, type: 2}
  - mesh: {fileID: -4974468161004867859, guid: 2c37fc2f835f24f8b96b0f8d5bbb09ff, type: 3}
    material: {fileID: 2100000, guid: ba518f2c0e9854fc399005788adb5e52, type: 2}
  - mesh: {fileID: -4974468161004867859, guid: 2c37fc2f835f24f8b96b0f8d5bbb09ff, type: 3}
    material: {fileID: 2100000, guid: ba518f2c0e9854fc399005788adb5e52, type: 2}
  - mesh: {fileID: -4974468161004867859, guid: 2c37fc2f835f24f8b96b0f8d5bbb09ff, type: 3}
    material: {fileID: 2100000, guid: ba518f2c0e9854fc399005788adb5e52, type: 2}
  - mesh: {fileID: -4974468161004867859, guid: 2c37fc2f835f24f8b96b0f8d5bbb09ff, type: 3}
    material: {fileID: 2100000, guid: ba518f2c0e9854fc399005788adb5e52, type: 2}
  - mesh: {fileID: -4974468161004867859, guid: 2c37fc2f835f24f8b96b0f8d5bbb09ff, type: 3}
    material: {fileID: 2100000, guid: ba518f2c0e9854fc399005788adb5e52, type: 2}
  - mesh: {fileID: -4974468161004867859, guid: 2c37fc2f835f24f8b96b0f8d5bbb09ff, type: 3}
    material: {fileID: 2100000, guid: ba518f2c0e9854fc399005788adb5e52, type: 2}
  - mesh: {fileID: -4974468161004867859, guid: 2c37fc2f835f24f8b96b0f8d5bbb09ff, type: 3}
    material: {fileID: 2100000, guid: ba518f2c0e9854fc399005788adb5e52, type: 2}
  - mesh: {fileID: -4974468161004867859, guid: 2c37fc2f835f24f8b96b0f8d5bbb09ff, type: 3}
    material: {fileID: 2100000, guid: ba518f2c0e9854fc399005788adb5e52, type: 2}
  - mesh: {fileID: -4974468161004867859, guid: 2c37fc2f835f24f8b96b0f8d5bbb09ff, type: 3}
    material: {fileID: 2100000, guid: ba518f2c0e9854fc399005788adb5e52, type: 2}
  - mesh: {fileID: -4974468161004867859, guid: 2c37fc2f835f24f8b96b0f8d5bbb09ff, type: 3}
    material: {fileID: 2100000, guid: ba518f2c0e9854fc399005788adb5e52, type: 2}
  - mesh: {fileID: -4974468161004867859, guid: 2c37fc2f835f24f8b96b0f8d5bbb09ff, type: 3}
    material: {fileID: 2100000, guid: ba518f2c0e9854fc399005788adb5e52, type: 2}
  - mesh: {fileID: -4974468161004867859, guid: 2c37fc2f835f24f8b96b0f8d5bbb09ff, type: 3}
    material: {fileID: 2100000, guid: ba518f2c0e9854fc399005788adb5e52, type: 2}
  - mesh: {fileID: -4974468161004867859, guid: 2c37fc2f835f24f8b96b0f8d5bbb09ff, type: 3}
    material: {fileID: 2100000, guid: ba518f2c0e9854fc399005788adb5e52, type: 2}
  - mesh: {fileID: -4974468161004867859, guid: 2c37fc2f835f24f8b96b0f8d5bbb09ff, type: 3}
    material: {fileID: 2100000, guid: ba518f2c0e9854fc399005788adb5e52, type: 2}
  - mesh: {fileID: -4974468161004867859, guid: 2c37fc2f835f24f8b96b0f8d5bbb09ff, type: 3}
    material: {fileID: 2100000, guid: ba518f2c0e9854fc399005788adb5e52, type: 2}
  - mesh: {fileID: -4974468161004867859, guid: 2c37fc2f835f24f8b96b0f8d5bbb09ff, type: 3}
    material: {fileID: 2100000, guid: ba518f2c0e9854fc399005788adb5e52, type: 2}
  - mesh: {fileID: -4974468161004867859, guid: 2c37fc2f835f24f8b96b0f8d5bbb09ff, type: 3}
    material: {fileID: 2100000, guid: ba518f2c0e9854fc399005788adb5e52, type: 2}
  - mesh: {fileID: -4974468161004867859, guid: 2c37fc2f835f24f8b96b0f8d5bbb09ff, type: 3}
    material: {fileID: 2100000, guid: ba518f2c0e9854fc399005788adb5e52, type: 2}
  - mesh: {fileID: -4974468161004867859, guid: 2c37fc2f835f24f8b96b0f8d5bbb09ff, type: 3}
    material: {fileID: 2100000, guid: ba518f2c0e9854fc399005788adb5e52, type: 2}
  - mesh: {fileID: -4974468161004867859, guid: 2c37fc2f835f24f8b96b0f8d5bbb09ff, type: 3}
    material: {fileID: 2100000, guid: ba518f2c0e9854fc399005788adb5e52, type: 2}
  - mesh: {fileID: -4974468161004867859, guid: 2c37fc2f835f24f8b96b0f8d5bbb09ff, type: 3}
    material: {fileID: 2100000, guid: ba518f2c0e9854fc399005788adb5e52, type: 2}
  - mesh: {fileID: -4974468161004867859, guid: 2c37fc2f835f24f8b96b0f8d5bbb09ff, type: 3}
    material: {fileID: 2100000, guid: ba518f2c0e9854fc399005788adb5e52, type: 2}
  - mesh: {fileID: -4974468161004867859, guid: 2c37fc2f835f24f8b96b0f8d5bbb09ff, type: 3}
    material: {fileID: 2100000, guid: ba518f2c0e9854fc399005788adb5e52, type: 2}
  - mesh: {fileID: -4974468161004867859, guid: 2c37fc2f835f24f8b96b0f8d5bbb09ff, type: 3}
    material: {fileID: 2100000, guid: ba518f2c0e9854fc399005788adb5e52, type: 2}
  - mesh: {fileID: -4974468161004867859, guid: 2c37fc2f835f24f8b96b0f8d5bbb09ff, type: 3}
    material: {fileID: 2100000, guid: ba518f2c0e9854fc399005788adb5e52, type: 2}
  - mesh: {fileID: -4974468161004867859, guid: 2c37fc2f835f24f8b96b0f8d5bbb09ff, type: 3}
    material: {fileID: 2100000, guid: ba518f2c0e9854fc399005788adb5e52, type: 2}
  - mesh: {fileID: -4974468161004867859, guid: 2c37fc2f835f24f8b96b0f8d5bbb09ff, type: 3}
    material: {fileID: 2100000, guid: ba518f2c0e9854fc399005788adb5e52, type: 2}
  - mesh: {fileID: -4974468161004867859, guid: 2c37fc2f835f24f8b96b0f8d5bbb09ff, type: 3}
    material: {fileID: 2100000, guid: ba518f2c0e9854fc399005788adb5e52, type: 2}
  - mesh: {fileID: -4974468161004867859, guid: 2c37fc2f835f24f8b96b0f8d5bbb09ff, type: 3}
    material: {fileID: 2100000, guid: ba518f2c0e9854fc399005788adb5e52, type: 2}
  - mesh: {fileID: -4974468161004867859, guid: 2c37fc2f835f24f8b96b0f8d5bbb09ff, type: 3}
    material: {fileID: 2100000, guid: ba518f2c0e9854fc399005788adb5e52, type: 2}
  - mesh: {fileID: -4974468161004867859, guid: 2c37fc2f835f24f8b96b0f8d5bbb09ff, type: 3}
    material: {fileID: 2100000, guid: ba518f2c0e9854fc399005788adb5e52, type: 2}
  - mesh: {fileID: -4974468161004867859, guid: 2c37fc2f835f24f8b96b0f8d5bbb09ff, type: 3}
    material: {fileID: 2100000, guid: ba518f2c0e9854fc399005788adb5e52, type: 2}
  - mesh: {fileID: -4974468161004867859, guid: 2c37fc2f835f24f8b96b0f8d5bbb09ff, type: 3}
    material: {fileID: 2100000, guid: ba518f2c0e9854fc399005788adb5e52, type: 2}
  - mesh: {fileID: -4974468161004867859, guid: 2c37fc2f835f24f8b96b0f8d5bbb09ff, type: 3}
    material: {fileID: 2100000, guid: ba518f2c0e9854fc399005788adb5e52, type: 2}
  - mesh: {fileID: -4974468161004867859, guid: 2c37fc2f835f24f8b96b0f8d5bbb09ff, type: 3}
    material: {fileID: 2100000, guid: ba518f2c0e9854fc399005788adb5e52, type: 2}
  - mesh: {fileID: -4974468161004867859, guid: 2c37fc2f835f24f8b96b0f8d5bbb09ff, type: 3}
    material: {fileID: 2100000, guid: ba518f2c0e9854fc399005788adb5e52, type: 2}
  - mesh: {fileID: -4974468161004867859, guid: 2c37fc2f835f24f8b96b0f8d5bbb09ff, type: 3}
    material: {fileID: 2100000, guid: ba518f2c0e9854fc399005788adb5e52, type: 2}
  - mesh: {fileID: -4974468161004867859, guid: 2c37fc2f835f24f8b96b0f8d5bbb09ff, type: 3}
    material: {fileID: 2100000, guid: ba518f2c0e9854fc399005788adb5e52, type: 2}
  - mesh: {fileID: -4974468161004867859, guid: 2c37fc2f835f24f8b96b0f8d5bbb09ff, type: 3}
    material: {fileID: 2100000, guid: ba518f2c0e9854fc399005788adb5e52, type: 2}
  - mesh: {fileID: -4974468161004867859, guid: 2c37fc2f835f24f8b96b0f8d5bbb09ff, type: 3}
    material: {fileID: 2100000, guid: ba518f2c0e9854fc399005788adb5e52, type: 2}
  - mesh: {fileID: -4974468161004867859, guid: 2c37fc2f835f24f8b96b0f8d5bbb09ff, type: 3}
    material: {fileID: 2100000, guid: ba518f2c0e9854fc399005788adb5e52, type: 2}
  - mesh: {fileID: -4974468161004867859, guid: 2c37fc2f835f24f8b96b0f8d5bbb09ff, type: 3}
    material: {fileID: 2100000, guid: ba518f2c0e9854fc399005788adb5e52, type: 2}
  - mesh: {fileID: -4974468161004867859, guid: 2c37fc2f835f24f8b96b0f8d5bbb09ff, type: 3}
    material: {fileID: 2100000, guid: ba518f2c0e9854fc399005788adb5e52, type: 2}
  - mesh: {fileID: -4974468161004867859, guid: 2c37fc2f835f24f8b96b0f8d5bbb09ff, type: 3}
    material: {fileID: 2100000, guid: ba518f2c0e9854fc399005788adb5e52, type: 2}
  - mesh: {fileID: -4974468161004867859, guid: 2c37fc2f835f24f8b96b0f8d5bbb09ff, type: 3}
    material: {fileID: 2100000, guid: ba518f2c0e9854fc399005788adb5e52, type: 2}
  - mesh: {fileID: -4974468161004867859, guid: 2c37fc2f835f24f8b96b0f8d5bbb09ff, type: 3}
    material: {fileID: 2100000, guid: ba518f2c0e9854fc399005788adb5e52, type: 2}
  - mesh: {fileID: -4974468161004867859, guid: 2c37fc2f835f24f8b96b0f8d5bbb09ff, type: 3}
    material: {fileID: 2100000, guid: ba518f2c0e9854fc399005788adb5e52, type: 2}
  - mesh: {fileID: -4974468161004867859, guid: 2c37fc2f835f24f8b96b0f8d5bbb09ff, type: 3}
    material: {fileID: 2100000, guid: ba518f2c0e9854fc399005788adb5e52, type: 2}
  - mesh: {fileID: -4974468161004867859, guid: 2c37fc2f835f24f8b96b0f8d5bbb09ff, type: 3}
    material: {fileID: 2100000, guid: ba518f2c0e9854fc399005788adb5e52, type: 2}
  - mesh: {fileID: -4974468161004867859, guid: 2c37fc2f835f24f8b96b0f8d5bbb09ff, type: 3}
    material: {fileID: 2100000, guid: ba518f2c0e9854fc399005788adb5e52, type: 2}
  - mesh: {fileID: -4974468161004867859, guid: 2c37fc2f835f24f8b96b0f8d5bbb09ff, type: 3}
    material: {fileID: 2100000, guid: ba518f2c0e9854fc399005788adb5e52, type: 2}
  - mesh: {fileID: -4974468161004867859, guid: 2c37fc2f835f24f8b96b0f8d5bbb09ff, type: 3}
    material: {fileID: 2100000, guid: ba518f2c0e9854fc399005788adb5e52, type: 2}
  - mesh: {fileID: -4974468161004867859, guid: 2c37fc2f835f24f8b96b0f8d5bbb09ff, type: 3}
    material: {fileID: 2100000, guid: ba518f2c0e9854fc399005788adb5e52, type: 2}
  - mesh: {fileID: -4974468161004867859, guid: 2c37fc2f835f24f8b96b0f8d5bbb09ff, type: 3}
    material: {fileID: 2100000, guid: ba518f2c0e9854fc399005788adb5e52, type: 2}
  - mesh: {fileID: -4974468161004867859, guid: 2c37fc2f835f24f8b96b0f8d5bbb09ff, type: 3}
    material: {fileID: 2100000, guid: ba518f2c0e9854fc399005788adb5e52, type: 2}
  - mesh: {fileID: -4974468161004867859, guid: 2c37fc2f835f24f8b96b0f8d5bbb09ff, type: 3}
    material: {fileID: 2100000, guid: ba518f2c0e9854fc399005788adb5e52, type: 2}
  - mesh: {fileID: -4974468161004867859, guid: 2c37fc2f835f24f8b96b0f8d5bbb09ff, type: 3}
    material: {fileID: 2100000, guid: ba518f2c0e9854fc399005788adb5e52, type: 2}
  - mesh: {fileID: -4974468161004867859, guid: 2c37fc2f835f24f8b96b0f8d5bbb09ff, type: 3}
    material: {fileID: 2100000, guid: ba518f2c0e9854fc399005788adb5e52, type: 2}
  - mesh: {fileID: -4974468161004867859, guid: 2c37fc2f835f24f8b96b0f8d5bbb09ff, type: 3}
    material: {fileID: 2100000, guid: ba518f2c0e9854fc399005788adb5e52, type: 2}
  - mesh: {fileID: -4974468161004867859, guid: 2c37fc2f835f24f8b96b0f8d5bbb09ff, type: 3}
    material: {fileID: 2100000, guid: ba518f2c0e9854fc399005788adb5e52, type: 2}
  - mesh: {fileID: -4974468161004867859, guid: 2c37fc2f835f24f8b96b0f8d5bbb09ff, type: 3}
    material: {fileID: 2100000, guid: ba518f2c0e9854fc399005788adb5e52, type: 2}
  - mesh: {fileID: -4974468161004867859, guid: 2c37fc2f835f24f8b96b0f8d5bbb09ff, type: 3}
    material: {fileID: 2100000, guid: ba518f2c0e9854fc399005788adb5e52, type: 2}
  - mesh: {fileID: -4974468161004867859, guid: 2c37fc2f835f24f8b96b0f8d5bbb09ff, type: 3}
    material: {fileID: 2100000, guid: ba518f2c0e9854fc399005788adb5e52, type: 2}
  - mesh: {fileID: -4974468161004867859, guid: 2c37fc2f835f24f8b96b0f8d5bbb09ff, type: 3}
    material: {fileID: 2100000, guid: ba518f2c0e9854fc399005788adb5e52, type: 2}
  - mesh: {fileID: -4974468161004867859, guid: 2c37fc2f835f24f8b96b0f8d5bbb09ff, type: 3}
    material: {fileID: 2100000, guid: ba518f2c0e9854fc399005788adb5e52, type: 2}
  - mesh: {fileID: -4974468161004867859, guid: 2c37fc2f835f24f8b96b0f8d5bbb09ff, type: 3}
    material: {fileID: 2100000, guid: ba518f2c0e9854fc399005788adb5e52, type: 2}
  - mesh: {fileID: -4974468161004867859, guid: 2c37fc2f835f24f8b96b0f8d5bbb09ff, type: 3}
    material: {fileID: 2100000, guid: ba518f2c0e9854fc399005788adb5e52, type: 2}
  - mesh: {fileID: -4974468161004867859, guid: 2c37fc2f835f24f8b96b0f8d5bbb09ff, type: 3}
    material: {fileID: 2100000, guid: ba518f2c0e9854fc399005788adb5e52, type: 2}
  - mesh: {fileID: -4974468161004867859, guid: 2c37fc2f835f24f8b96b0f8d5bbb09ff, type: 3}
    material: {fileID: 2100000, guid: ba518f2c0e9854fc399005788adb5e52, type: 2}
  - mesh: {fileID: -4974468161004867859, guid: 2c37fc2f835f24f8b96b0f8d5bbb09ff, type: 3}
    material: {fileID: 2100000, guid: ba518f2c0e9854fc399005788adb5e52, type: 2}
  - mesh: {fileID: -4974468161004867859, guid: 2c37fc2f835f24f8b96b0f8d5bbb09ff, type: 3}
    material: {fileID: 2100000, guid: ba518f2c0e9854fc399005788adb5e52, type: 2}
  - mesh: {fileID: -4974468161004867859, guid: 2c37fc2f835f24f8b96b0f8d5bbb09ff, type: 3}
    material: {fileID: 2100000, guid: ba518f2c0e9854fc399005788adb5e52, type: 2}
  - mesh: {fileID: -4974468161004867859, guid: 2c37fc2f835f24f8b96b0f8d5bbb09ff, type: 3}
    material: {fileID: 2100000, guid: ba518f2c0e9854fc399005788adb5e52, type: 2}
  - mesh: {fileID: -4974468161004867859, guid: 2c37fc2f835f24f8b96b0f8d5bbb09ff, type: 3}
    material: {fileID: 2100000, guid: ba518f2c0e9854fc399005788adb5e52, type: 2}
  - mesh: {fileID: -4974468161004867859, guid: 2c37fc2f835f24f8b96b0f8d5bbb09ff, type: 3}
    material: {fileID: 2100000, guid: ba518f2c0e9854fc399005788adb5e52, type: 2}
  - mesh: {fileID: -4974468161004867859, guid: 2c37fc2f835f24f8b96b0f8d5bbb09ff, type: 3}
    material: {fileID: 2100000, guid: ba518f2c0e9854fc399005788adb5e52, type: 2}
  - mesh: {fileID: -4974468161004867859, guid: 2c37fc2f835f24f8b96b0f8d5bbb09ff, type: 3}
    material: {fileID: 2100000, guid: ba518f2c0e9854fc399005788adb5e52, type: 2}
  - mesh: {fileID: -4974468161004867859, guid: 2c37fc2f835f24f8b96b0f8d5bbb09ff, type: 3}
    material: {fileID: 2100000, guid: ba518f2c0e9854fc399005788adb5e52, type: 2}
  - mesh: {fileID: -4974468161004867859, guid: 2c37fc2f835f24f8b96b0f8d5bbb09ff, type: 3}
    material: {fileID: 2100000, guid: ba518f2c0e9854fc399005788adb5e52, type: 2}
  - mesh: {fileID: -4974468161004867859, guid: 2c37fc2f835f24f8b96b0f8d5bbb09ff, type: 3}
    material: {fileID: 2100000, guid: ba518f2c0e9854fc399005788adb5e52, type: 2}
  - mesh: {fileID: -4974468161004867859, guid: 2c37fc2f835f24f8b96b0f8d5bbb09ff, type: 3}
    material: {fileID: 2100000, guid: ba518f2c0e9854fc399005788adb5e52, type: 2}
  - mesh: {fileID: -4974468161004867859, guid: 2c37fc2f835f24f8b96b0f8d5bbb09ff, type: 3}
    material: {fileID: 2100000, guid: ba518f2c0e9854fc399005788adb5e52, type: 2}
  - mesh: {fileID: -4974468161004867859, guid: 2c37fc2f835f24f8b96b0f8d5bbb09ff, type: 3}
    material: {fileID: 2100000, guid: ba518f2c0e9854fc399005788adb5e52, type: 2}
  - mesh: {fileID: -4974468161004867859, guid: 2c37fc2f835f24f8b96b0f8d5bbb09ff, type: 3}
    material: {fileID: 2100000, guid: ba518f2c0e9854fc399005788adb5e52, type: 2}
  - mesh: {fileID: -4974468161004867859, guid: 2c37fc2f835f24f8b96b0f8d5bbb09ff, type: 3}
    material: {fileID: 2100000, guid: ba518f2c0e9854fc399005788adb5e52, type: 2}
  - mesh: {fileID: -4974468161004867859, guid: 2c37fc2f835f24f8b96b0f8d5bbb09ff, type: 3}
    material: {fileID: 2100000, guid: ba518f2c0e9854fc399005788adb5e52, type: 2}
  - mesh: {fileID: -4974468161004867859, guid: 2c37fc2f835f24f8b96b0f8d5bbb09ff, type: 3}
    material: {fileID: 2100000, guid: ba518f2c0e9854fc399005788adb5e52, type: 2}
  - mesh: {fileID: -4974468161004867859, guid: 2c37fc2f835f24f8b96b0f8d5bbb09ff, type: 3}
    material: {fileID: 2100000, guid: ba518f2c0e9854fc399005788adb5e52, type: 2}
  - mesh: {fileID: -4974468161004867859, guid: 2c37fc2f835f24f8b96b0f8d5bbb09ff, type: 3}
    material: {fileID: 2100000, guid: ba518f2c0e9854fc399005788adb5e52, type: 2}
  - mesh: {fileID: -4974468161004867859, guid: 2c37fc2f835f24f8b96b0f8d5bbb09ff, type: 3}
    material: {fileID: 2100000, guid: ba518f2c0e9854fc399005788adb5e52, type: 2}
  - mesh: {fileID: -4974468161004867859, guid: 2c37fc2f835f24f8b96b0f8d5bbb09ff, type: 3}
    material: {fileID: 2100000, guid: ba518f2c0e9854fc399005788adb5e52, type: 2}
  - mesh: {fileID: -4974468161004867859, guid: 2c37fc2f835f24f8b96b0f8d5bbb09ff, type: 3}
    material: {fileID: 2100000, guid: ba518f2c0e9854fc399005788adb5e52, type: 2}
  - mesh: {fileID: -4974468161004867859, guid: 2c37fc2f835f24f8b96b0f8d5bbb09ff, type: 3}
    material: {fileID: 2100000, guid: ba518f2c0e9854fc399005788adb5e52, type: 2}
  - mesh: {fileID: -4974468161004867859, guid: 2c37fc2f835f24f8b96b0f8d5bbb09ff, type: 3}
    material: {fileID: 2100000, guid: ba518f2c0e9854fc399005788adb5e52, type: 2}
  - mesh: {fileID: -4974468161004867859, guid: 2c37fc2f835f24f8b96b0f8d5bbb09ff, type: 3}
    material: {fileID: 2100000, guid: ba518f2c0e9854fc399005788adb5e52, type: 2}
  - mesh: {fileID: -4974468161004867859, guid: 2c37fc2f835f24f8b96b0f8d5bbb09ff, type: 3}
    material: {fileID: 2100000, guid: ba518f2c0e9854fc399005788adb5e52, type: 2}
  - mesh: {fileID: -4974468161004867859, guid: 2c37fc2f835f24f8b96b0f8d5bbb09ff, type: 3}
    material: {fileID: 2100000, guid: ba518f2c0e9854fc399005788adb5e52, type: 2}
  - mesh: {fileID: -4974468161004867859, guid: 2c37fc2f835f24f8b96b0f8d5bbb09ff, type: 3}
    material: {fileID: 2100000, guid: ba518f2c0e9854fc399005788adb5e52, type: 2}
  - mesh: {fileID: -4974468161004867859, guid: 2c37fc2f835f24f8b96b0f8d5bbb09ff, type: 3}
    material: {fileID: 2100000, guid: ba518f2c0e9854fc399005788adb5e52, type: 2}
  - mesh: {fileID: -4974468161004867859, guid: 2c37fc2f835f24f8b96b0f8d5bbb09ff, type: 3}
    material: {fileID: 2100000, guid: ba518f2c0e9854fc399005788adb5e52, type: 2}
  - mesh: {fileID: -4974468161004867859, guid: 2c37fc2f835f24f8b96b0f8d5bbb09ff, type: 3}
    material: {fileID: 2100000, guid: ba518f2c0e9854fc399005788adb5e52, type: 2}
  - mesh: {fileID: -4974468161004867859, guid: 2c37fc2f835f24f8b96b0f8d5bbb09ff, type: 3}
    material: {fileID: 2100000, guid: ba518f2c0e9854fc399005788adb5e52, type: 2}
  - mesh: {fileID: -4974468161004867859, guid: 2c37fc2f835f24f8b96b0f8d5bbb09ff, type: 3}
    material: {fileID: 2100000, guid: ba518f2c0e9854fc399005788adb5e52, type: 2}
  - mesh: {fileID: -4974468161004867859, guid: 2c37fc2f835f24f8b96b0f8d5bbb09ff, type: 3}
    material: {fileID: 2100000, guid: ba518f2c0e9854fc399005788adb5e52, type: 2}
  - mesh: {fileID: -4974468161004867859, guid: 2c37fc2f835f24f8b96b0f8d5bbb09ff, type: 3}
    material: {fileID: 2100000, guid: ba518f2c0e9854fc399005788adb5e52, type: 2}
  - mesh: {fileID: -4974468161004867859, guid: 2c37fc2f835f24f8b96b0f8d5bbb09ff, type: 3}
    material: {fileID: 2100000, guid: ba518f2c0e9854fc399005788adb5e52, type: 2}
  - mesh: {fileID: -4974468161004867859, guid: 2c37fc2f835f24f8b96b0f8d5bbb09ff, type: 3}
    material: {fileID: 2100000, guid: ba518f2c0e9854fc399005788adb5e52, type: 2}
  - mesh: {fileID: -4974468161004867859, guid: 2c37fc2f835f24f8b96b0f8d5bbb09ff, type: 3}
    material: {fileID: 2100000, guid: ba518f2c0e9854fc399005788adb5e52, type: 2}
  - mesh: {fileID: -4974468161004867859, guid: 2c37fc2f835f24f8b96b0f8d5bbb09ff, type: 3}
    material: {fileID: 2100000, guid: ba518f2c0e9854fc399005788adb5e52, type: 2}
  - mesh: {fileID: -4974468161004867859, guid: 2c37fc2f835f24f8b96b0f8d5bbb09ff, type: 3}
    material: {fileID: 2100000, guid: ba518f2c0e9854fc399005788adb5e52, type: 2}
  - mesh: {fileID: -4974468161004867859, guid: 2c37fc2f835f24f8b96b0f8d5bbb09ff, type: 3}
    material: {fileID: 2100000, guid: ba518f2c0e9854fc399005788adb5e52, type: 2}
  - mesh: {fileID: -4974468161004867859, guid: 2c37fc2f835f24f8b96b0f8d5bbb09ff, type: 3}
    material: {fileID: 2100000, guid: ba518f2c0e9854fc399005788adb5e52, type: 2}
  - mesh: {fileID: -4974468161004867859, guid: 2c37fc2f835f24f8b96b0f8d5bbb09ff, type: 3}
    material: {fileID: 2100000, guid: ba518f2c0e9854fc399005788adb5e52, type: 2}
  - mesh: {fileID: -4974468161004867859, guid: 2c37fc2f835f24f8b96b0f8d5bbb09ff, type: 3}
    material: {fileID: 2100000, guid: ba518f2c0e9854fc399005788adb5e52, type: 2}
  - mesh: {fileID: -4974468161004867859, guid: 2c37fc2f835f24f8b96b0f8d5bbb09ff, type: 3}
    material: {fileID: 2100000, guid: ba518f2c0e9854fc399005788adb5e52, type: 2}
  - mesh: {fileID: -4974468161004867859, guid: 2c37fc2f835f24f8b96b0f8d5bbb09ff, type: 3}
    material: {fileID: 2100000, guid: ba518f2c0e9854fc399005788adb5e52, type: 2}
  - mesh: {fileID: -4974468161004867859, guid: 2c37fc2f835f24f8b96b0f8d5bbb09ff, type: 3}
    material: {fileID: 2100000, guid: ba518f2c0e9854fc399005788adb5e52, type: 2}
  - mesh: {fileID: -4974468161004867859, guid: 2c37fc2f835f24f8b96b0f8d5bbb09ff, type: 3}
    material: {fileID: 2100000, guid: ba518f2c0e9854fc399005788adb5e52, type: 2}
  - mesh: {fileID: -4974468161004867859, guid: 2c37fc2f835f24f8b96b0f8d5bbb09ff, type: 3}
    material: {fileID: 2100000, guid: ba518f2c0e9854fc399005788adb5e52, type: 2}
  - mesh: {fileID: -4974468161004867859, guid: 2c37fc2f835f24f8b96b0f8d5bbb09ff, type: 3}
    material: {fileID: 2100000, guid: ba518f2c0e9854fc399005788adb5e52, type: 2}
  - mesh: {fileID: -4974468161004867859, guid: 2c37fc2f835f24f8b96b0f8d5bbb09ff, type: 3}
    material: {fileID: 2100000, guid: ba518f2c0e9854fc399005788adb5e52, type: 2}
  - mesh: {fileID: -4974468161004867859, guid: 2c37fc2f835f24f8b96b0f8d5bbb09ff, type: 3}
    material: {fileID: 2100000, guid: ba518f2c0e9854fc399005788adb5e52, type: 2}
  - mesh: {fileID: -4974468161004867859, guid: 2c37fc2f835f24f8b96b0f8d5bbb09ff, type: 3}
    material: {fileID: 2100000, guid: ba518f2c0e9854fc399005788adb5e52, type: 2}
  - mesh: {fileID: -4974468161004867859, guid: 2c37fc2f835f24f8b96b0f8d5bbb09ff, type: 3}
    material: {fileID: 2100000, guid: ba518f2c0e9854fc399005788adb5e52, type: 2}
  - mesh: {fileID: -4974468161004867859, guid: 2c37fc2f835f24f8b96b0f8d5bbb09ff, type: 3}
    material: {fileID: 2100000, guid: ba518f2c0e9854fc399005788adb5e52, type: 2}
  - mesh: {fileID: -4974468161004867859, guid: 2c37fc2f835f24f8b96b0f8d5bbb09ff, type: 3}
    material: {fileID: 2100000, guid: ba518f2c0e9854fc399005788adb5e52, type: 2}
  - mesh: {fileID: -4974468161004867859, guid: 2c37fc2f835f24f8b96b0f8d5bbb09ff, type: 3}
    material: {fileID: 2100000, guid: ba518f2c0e9854fc399005788adb5e52, type: 2}
  - mesh: {fileID: -4974468161004867859, guid: 2c37fc2f835f24f8b96b0f8d5bbb09ff, type: 3}
    material: {fileID: 2100000, guid: ba518f2c0e9854fc399005788adb5e52, type: 2}
  - mesh: {fileID: -4974468161004867859, guid: 2c37fc2f835f24f8b96b0f8d5bbb09ff, type: 3}
    material: {fileID: 2100000, guid: ba518f2c0e9854fc399005788adb5e52, type: 2}
  - mesh: {fileID: -4974468161004867859, guid: 2c37fc2f835f24f8b96b0f8d5bbb09ff, type: 3}
    material: {fileID: 2100000, guid: ba518f2c0e9854fc399005788adb5e52, type: 2}
  - mesh: {fileID: -4974468161004867859, guid: 2c37fc2f835f24f8b96b0f8d5bbb09ff, type: 3}
    material: {fileID: 2100000, guid: ba518f2c0e9854fc399005788adb5e52, type: 2}
  - mesh: {fileID: -4974468161004867859, guid: 2c37fc2f835f24f8b96b0f8d5bbb09ff, type: 3}
    material: {fileID: 2100000, guid: ba518f2c0e9854fc399005788adb5e52, type: 2}
  - mesh: {fileID: -4974468161004867859, guid: 2c37fc2f835f24f8b96b0f8d5bbb09ff, type: 3}
    material: {fileID: 2100000, guid: ba518f2c0e9854fc399005788adb5e52, type: 2}
  - mesh: {fileID: -4974468161004867859, guid: 2c37fc2f835f24f8b96b0f8d5bbb09ff, type: 3}
    material: {fileID: 2100000, guid: ba518f2c0e9854fc399005788adb5e52, type: 2}
  - mesh: {fileID: -4974468161004867859, guid: 2c37fc2f835f24f8b96b0f8d5bbb09ff, type: 3}
    material: {fileID: 2100000, guid: ba518f2c0e9854fc399005788adb5e52, type: 2}
  - mesh: {fileID: -4974468161004867859, guid: 2c37fc2f835f24f8b96b0f8d5bbb09ff, type: 3}
    material: {fileID: 2100000, guid: ba518f2c0e9854fc399005788adb5e52, type: 2}
  - mesh: {fileID: -4974468161004867859, guid: 2c37fc2f835f24f8b96b0f8d5bbb09ff, type: 3}
    material: {fileID: 2100000, guid: ba518f2c0e9854fc399005788adb5e52, type: 2}
  - mesh: {fileID: -4974468161004867859, guid: 2c37fc2f835f24f8b96b0f8d5bbb09ff, type: 3}
    material: {fileID: 2100000, guid: ba518f2c0e9854fc399005788adb5e52, type: 2}
  - mesh: {fileID: -4974468161004867859, guid: 2c37fc2f835f24f8b96b0f8d5bbb09ff, type: 3}
    material: {fileID: 2100000, guid: ba518f2c0e9854fc399005788adb5e52, type: 2}
  - mesh: {fileID: -4974468161004867859, guid: 2c37fc2f835f24f8b96b0f8d5bbb09ff, type: 3}
    material: {fileID: 2100000, guid: ba518f2c0e9854fc399005788adb5e52, type: 2}
  - mesh: {fileID: -4974468161004867859, guid: 2c37fc2f835f24f8b96b0f8d5bbb09ff, type: 3}
    material: {fileID: 2100000, guid: ba518f2c0e9854fc399005788adb5e52, type: 2}
  - mesh: {fileID: -4974468161004867859, guid: 2c37fc2f835f24f8b96b0f8d5bbb09ff, type: 3}
    material: {fileID: 2100000, guid: ba518f2c0e9854fc399005788adb5e52, type: 2}
  - mesh: {fileID: -4974468161004867859, guid: 2c37fc2f835f24f8b96b0f8d5bbb09ff, type: 3}
    material: {fileID: 2100000, guid: ba518f2c0e9854fc399005788adb5e52, type: 2}
  - mesh: {fileID: -4974468161004867859, guid: 2c37fc2f835f24f8b96b0f8d5bbb09ff, type: 3}
    material: {fileID: 2100000, guid: ba518f2c0e9854fc399005788adb5e52, type: 2}
  - mesh: {fileID: -4974468161004867859, guid: 2c37fc2f835f24f8b96b0f8d5bbb09ff, type: 3}
    material: {fileID: 2100000, guid: ba518f2c0e9854fc399005788adb5e52, type: 2}
  - mesh: {fileID: -4974468161004867859, guid: 2c37fc2f835f24f8b96b0f8d5bbb09ff, type: 3}
    material: {fileID: 2100000, guid: ba518f2c0e9854fc399005788adb5e52, type: 2}
  - mesh: {fileID: -4974468161004867859, guid: 2c37fc2f835f24f8b96b0f8d5bbb09ff, type: 3}
    material: {fileID: 2100000, guid: ba518f2c0e9854fc399005788adb5e52, type: 2}
  - mesh: {fileID: -4974468161004867859, guid: 2c37fc2f835f24f8b96b0f8d5bbb09ff, type: 3}
    material: {fileID: 2100000, guid: ba518f2c0e9854fc399005788adb5e52, type: 2}
  - mesh: {fileID: -4974468161004867859, guid: 2c37fc2f835f24f8b96b0f8d5bbb09ff, type: 3}
    material: {fileID: 2100000, guid: ba518f2c0e9854fc399005788adb5e52, type: 2}
  - mesh: {fileID: -4974468161004867859, guid: 2c37fc2f835f24f8b96b0f8d5bbb09ff, type: 3}
    material: {fileID: 2100000, guid: ba518f2c0e9854fc399005788adb5e52, type: 2}
  - mesh: {fileID: -4974468161004867859, guid: 2c37fc2f835f24f8b96b0f8d5bbb09ff, type: 3}
    material: {fileID: 2100000, guid: ba518f2c0e9854fc399005788adb5e52, type: 2}
  - mesh: {fileID: -4974468161004867859, guid: 2c37fc2f835f24f8b96b0f8d5bbb09ff, type: 3}
    material: {fileID: 2100000, guid: ba518f2c0e9854fc399005788adb5e52, type: 2}
  - mesh: {fileID: -4974468161004867859, guid: 2c37fc2f835f24f8b96b0f8d5bbb09ff, type: 3}
    material: {fileID: 2100000, guid: ba518f2c0e9854fc399005788adb5e52, type: 2}
  - mesh: {fileID: -4974468161004867859, guid: 2c37fc2f835f24f8b96b0f8d5bbb09ff, type: 3}
    material: {fileID: 2100000, guid: ba518f2c0e9854fc399005788adb5e52, type: 2}
  - mesh: {fileID: -4974468161004867859, guid: 2c37fc2f835f24f8b96b0f8d5bbb09ff, type: 3}
    material: {fileID: 2100000, guid: ba518f2c0e9854fc399005788adb5e52, type: 2}
  - mesh: {fileID: -4974468161004867859, guid: 2c37fc2f835f24f8b96b0f8d5bbb09ff, type: 3}
    material: {fileID: 2100000, guid: ba518f2c0e9854fc399005788adb5e52, type: 2}
  - mesh: {fileID: -4974468161004867859, guid: 2c37fc2f835f24f8b96b0f8d5bbb09ff, type: 3}
    material: {fileID: 2100000, guid: ba518f2c0e9854fc399005788adb5e52, type: 2}
  - mesh: {fileID: -4974468161004867859, guid: 2c37fc2f835f24f8b96b0f8d5bbb09ff, type: 3}
    material: {fileID: 2100000, guid: ba518f2c0e9854fc399005788adb5e52, type: 2}
  - mesh: {fileID: -4974468161004867859, guid: 2c37fc2f835f24f8b96b0f8d5bbb09ff, type: 3}
    material: {fileID: 2100000, guid: ba518f2c0e9854fc399005788adb5e52, type: 2}
  - mesh: {fileID: -4974468161004867859, guid: 2c37fc2f835f24f8b96b0f8d5bbb09ff, type: 3}
    material: {fileID: 2100000, guid: ba518f2c0e9854fc399005788adb5e52, type: 2}
  - mesh: {fileID: -4974468161004867859, guid: 2c37fc2f835f24f8b96b0f8d5bbb09ff, type: 3}
    material: {fileID: 2100000, guid: ba518f2c0e9854fc399005788adb5e52, type: 2}
  - mesh: {fileID: -4974468161004867859, guid: 2c37fc2f835f24f8b96b0f8d5bbb09ff, type: 3}
    material: {fileID: 2100000, guid: ba518f2c0e9854fc399005788adb5e52, type: 2}
  - mesh: {fileID: -4974468161004867859, guid: 2c37fc2f835f24f8b96b0f8d5bbb09ff, type: 3}
    material: {fileID: 2100000, guid: ba518f2c0e9854fc399005788adb5e52, type: 2}
  - mesh: {fileID: -4974468161004867859, guid: 2c37fc2f835f24f8b96b0f8d5bbb09ff, type: 3}
    material: {fileID: 2100000, guid: ba518f2c0e9854fc399005788adb5e52, type: 2}
  - mesh: {fileID: -4974468161004867859, guid: 2c37fc2f835f24f8b96b0f8d5bbb09ff, type: 3}
    material: {fileID: 2100000, guid: ba518f2c0e9854fc399005788adb5e52, type: 2}
  - mesh: {fileID: -4974468161004867859, guid: 2c37fc2f835f24f8b96b0f8d5bbb09ff, type: 3}
    material: {fileID: 2100000, guid: ba518f2c0e9854fc399005788adb5e52, type: 2}
  - mesh: {fileID: -4974468161004867859, guid: 2c37fc2f835f24f8b96b0f8d5bbb09ff, type: 3}
    material: {fileID: 2100000, guid: ba518f2c0e9854fc399005788adb5e52, type: 2}
  - mesh: {fileID: -4974468161004867859, guid: 2c37fc2f835f24f8b96b0f8d5bbb09ff, type: 3}
    material: {fileID: 2100000, guid: ba518f2c0e9854fc399005788adb5e52, type: 2}
  - mesh: {fileID: -4974468161004867859, guid: 2c37fc2f835f24f8b96b0f8d5bbb09ff, type: 3}
    material: {fileID: 2100000, guid: ba518f2c0e9854fc399005788adb5e52, type: 2}
  - mesh: {fileID: -4974468161004867859, guid: 2c37fc2f835f24f8b96b0f8d5bbb09ff, type: 3}
    material: {fileID: 2100000, guid: ba518f2c0e9854fc399005788adb5e52, type: 2}
  - mesh: {fileID: -4974468161004867859, guid: 2c37fc2f835f24f8b96b0f8d5bbb09ff, type: 3}
    material: {fileID: 2100000, guid: ba518f2c0e9854fc399005788adb5e52, type: 2}
  - mesh: {fileID: -4974468161004867859, guid: 2c37fc2f835f24f8b96b0f8d5bbb09ff, type: 3}
    material: {fileID: 2100000, guid: ba518f2c0e9854fc399005788adb5e52, type: 2}
  - mesh: {fileID: -4974468161004867859, guid: 2c37fc2f835f24f8b96b0f8d5bbb09ff, type: 3}
    material: {fileID: 2100000, guid: ba518f2c0e9854fc399005788adb5e52, type: 2}
  - mesh: {fileID: -4974468161004867859, guid: 2c37fc2f835f24f8b96b0f8d5bbb09ff, type: 3}
    material: {fileID: 2100000, guid: ba518f2c0e9854fc399005788adb5e52, type: 2}
  - mesh: {fileID: -4974468161004867859, guid: 2c37fc2f835f24f8b96b0f8d5bbb09ff, type: 3}
    material: {fileID: 2100000, guid: ba518f2c0e9854fc399005788adb5e52, type: 2}
  - mesh: {fileID: -4974468161004867859, guid: 2c37fc2f835f24f8b96b0f8d5bbb09ff, type: 3}
    material: {fileID: 2100000, guid: ba518f2c0e9854fc399005788adb5e52, type: 2}
  - mesh: {fileID: -4974468161004867859, guid: 2c37fc2f835f24f8b96b0f8d5bbb09ff, type: 3}
    material: {fileID: 2100000, guid: ba518f2c0e9854fc399005788adb5e52, type: 2}
  - mesh: {fileID: -4974468161004867859, guid: 2c37fc2f835f24f8b96b0f8d5bbb09ff, type: 3}
    material: {fileID: 2100000, guid: ba518f2c0e9854fc399005788adb5e52, type: 2}
  - mesh: {fileID: -4974468161004867859, guid: 2c37fc2f835f24f8b96b0f8d5bbb09ff, type: 3}
    material: {fileID: 2100000, guid: ba518f2c0e9854fc399005788adb5e52, type: 2}
  - mesh: {fileID: -4974468161004867859, guid: 2c37fc2f835f24f8b96b0f8d5bbb09ff, type: 3}
    material: {fileID: 2100000, guid: ba518f2c0e9854fc399005788adb5e52, type: 2}
  - mesh: {fileID: -4974468161004867859, guid: 2c37fc2f835f24f8b96b0f8d5bbb09ff, type: 3}
    material: {fileID: 2100000, guid: ba518f2c0e9854fc399005788adb5e52, type: 2}
  - mesh: {fileID: -4974468161004867859, guid: 2c37fc2f835f24f8b96b0f8d5bbb09ff, type: 3}
    material: {fileID: 2100000, guid: ba518f2c0e9854fc399005788adb5e52, type: 2}
  - mesh: {fileID: -4974468161004867859, guid: 2c37fc2f835f24f8b96b0f8d5bbb09ff, type: 3}
    material: {fileID: 2100000, guid: ba518f2c0e9854fc399005788adb5e52, type: 2}
  - mesh: {fileID: -4974468161004867859, guid: 2c37fc2f835f24f8b96b0f8d5bbb09ff, type: 3}
    material: {fileID: 2100000, guid: ba518f2c0e9854fc399005788adb5e52, type: 2}
  - mesh: {fileID: -4974468161004867859, guid: 2c37fc2f835f24f8b96b0f8d5bbb09ff, type: 3}
    material: {fileID: 2100000, guid: ba518f2c0e9854fc399005788adb5e52, type: 2}
  - mesh: {fileID: -4974468161004867859, guid: 2c37fc2f835f24f8b96b0f8d5bbb09ff, type: 3}
    material: {fileID: 2100000, guid: ba518f2c0e9854fc399005788adb5e52, type: 2}
  - mesh: {fileID: -4974468161004867859, guid: 2c37fc2f835f24f8b96b0f8d5bbb09ff, type: 3}
    material: {fileID: 2100000, guid: ba518f2c0e9854fc399005788adb5e52, type: 2}
  - mesh: {fileID: -4974468161004867859, guid: 2c37fc2f835f24f8b96b0f8d5bbb09ff, type: 3}
    material: {fileID: 2100000, guid: ba518f2c0e9854fc399005788adb5e52, type: 2}
  - mesh: {fileID: -4974468161004867859, guid: 2c37fc2f835f24f8b96b0f8d5bbb09ff, type: 3}
    material: {fileID: 2100000, guid: ba518f2c0e9854fc399005788adb5e52, type: 2}
  - mesh: {fileID: -4974468161004867859, guid: 2c37fc2f835f24f8b96b0f8d5bbb09ff, type: 3}
    material: {fileID: 2100000, guid: ba518f2c0e9854fc399005788adb5e52, type: 2}
  - mesh: {fileID: -4974468161004867859, guid: 2c37fc2f835f24f8b96b0f8d5bbb09ff, type: 3}
    material: {fileID: 2100000, guid: ba518f2c0e9854fc399005788adb5e52, type: 2}
  - mesh: {fileID: -4974468161004867859, guid: 2c37fc2f835f24f8b96b0f8d5bbb09ff, type: 3}
    material: {fileID: 2100000, guid: ba518f2c0e9854fc399005788adb5e52, type: 2}
  - mesh: {fileID: -4974468161004867859, guid: 2c37fc2f835f24f8b96b0f8d5bbb09ff, type: 3}
    material: {fileID: 2100000, guid: ba518f2c0e9854fc399005788adb5e52, type: 2}
  - mesh: {fileID: -4974468161004867859, guid: 2c37fc2f835f24f8b96b0f8d5bbb09ff, type: 3}
    material: {fileID: 2100000, guid: ba518f2c0e9854fc399005788adb5e52, type: 2}
  - mesh: {fileID: -4974468161004867859, guid: 2c37fc2f835f24f8b96b0f8d5bbb09ff, type: 3}
    material: {fileID: 2100000, guid: ba518f2c0e9854fc399005788adb5e52, type: 2}
  - mesh: {fileID: -4974468161004867859, guid: 2c37fc2f835f24f8b96b0f8d5bbb09ff, type: 3}
    material: {fileID: 2100000, guid: ba518f2c0e9854fc399005788adb5e52, type: 2}
  - mesh: {fileID: -4974468161004867859, guid: 2c37fc2f835f24f8b96b0f8d5bbb09ff, type: 3}
    material: {fileID: 2100000, guid: ba518f2c0e9854fc399005788adb5e52, type: 2}
  - mesh: {fileID: -4974468161004867859, guid: 2c37fc2f835f24f8b96b0f8d5bbb09ff, type: 3}
    material: {fileID: 2100000, guid: ba518f2c0e9854fc399005788adb5e52, type: 2}
  - mesh: {fileID: -4974468161004867859, guid: 2c37fc2f835f24f8b96b0f8d5bbb09ff, type: 3}
    material: {fileID: 2100000, guid: ba518f2c0e9854fc399005788adb5e52, type: 2}
  - mesh: {fileID: -4974468161004867859, guid: 2c37fc2f835f24f8b96b0f8d5bbb09ff, type: 3}
    material: {fileID: 2100000, guid: ba518f2c0e9854fc399005788adb5e52, type: 2}
  - mesh: {fileID: -4974468161004867859, guid: 2c37fc2f835f24f8b96b0f8d5bbb09ff, type: 3}
    material: {fileID: 2100000, guid: ba518f2c0e9854fc399005788adb5e52, type: 2}
  - mesh: {fileID: -4974468161004867859, guid: 2c37fc2f835f24f8b96b0f8d5bbb09ff, type: 3}
    material: {fileID: 2100000, guid: ba518f2c0e9854fc399005788adb5e52, type: 2}
  - mesh: {fileID: -4974468161004867859, guid: 2c37fc2f835f24f8b96b0f8d5bbb09ff, type: 3}
    material: {fileID: 2100000, guid: ba518f2c0e9854fc399005788adb5e52, type: 2}
  - mesh: {fileID: -4974468161004867859, guid: 2c37fc2f835f24f8b96b0f8d5bbb09ff, type: 3}
    material: {fileID: 2100000, guid: ba518f2c0e9854fc399005788adb5e52, type: 2}
  - mesh: {fileID: -4974468161004867859, guid: 2c37fc2f835f24f8b96b0f8d5bbb09ff, type: 3}
    material: {fileID: 2100000, guid: ba518f2c0e9854fc399005788adb5e52, type: 2}
  - mesh: {fileID: -4974468161004867859, guid: 2c37fc2f835f24f8b96b0f8d5bbb09ff, type: 3}
    material: {fileID: 2100000, guid: ba518f2c0e9854fc399005788adb5e52, type: 2}
  - mesh: {fileID: -4974468161004867859, guid: 2c37fc2f835f24f8b96b0f8d5bbb09ff, type: 3}
    material: {fileID: 2100000, guid: ba518f2c0e9854fc399005788adb5e52, type: 2}
  - mesh: {fileID: -4974468161004867859, guid: 2c37fc2f835f24f8b96b0f8d5bbb09ff, type: 3}
    material: {fileID: 2100000, guid: ba518f2c0e9854fc399005788adb5e52, type: 2}
  - mesh: {fileID: -4974468161004867859, guid: 2c37fc2f835f24f8b96b0f8d5bbb09ff, type: 3}
    material: {fileID: 2100000, guid: ba518f2c0e9854fc399005788adb5e52, type: 2}
  - mesh: {fileID: -4974468161004867859, guid: 2c37fc2f835f24f8b96b0f8d5bbb09ff, type: 3}
    material: {fileID: 2100000, guid: ba518f2c0e9854fc399005788adb5e52, type: 2}
  - mesh: {fileID: -4974468161004867859, guid: 2c37fc2f835f24f8b96b0f8d5bbb09ff, type: 3}
    material: {fileID: 2100000, guid: ba518f2c0e9854fc399005788adb5e52, type: 2}
  - mesh: {fileID: -4974468161004867859, guid: 2c37fc2f835f24f8b96b0f8d5bbb09ff, type: 3}
    material: {fileID: 2100000, guid: ba518f2c0e9854fc399005788adb5e52, type: 2}
  - mesh: {fileID: -4974468161004867859, guid: 2c37fc2f835f24f8b96b0f8d5bbb09ff, type: 3}
    material: {fileID: 2100000, guid: ba518f2c0e9854fc399005788adb5e52, type: 2}
  - mesh: {fileID: -4974468161004867859, guid: 2c37fc2f835f24f8b96b0f8d5bbb09ff, type: 3}
    material: {fileID: 2100000, guid: ba518f2c0e9854fc399005788adb5e52, type: 2}
  - mesh: {fileID: -4974468161004867859, guid: 2c37fc2f835f24f8b96b0f8d5bbb09ff, type: 3}
    material: {fileID: 2100000, guid: ba518f2c0e9854fc399005788adb5e52, type: 2}
  - mesh: {fileID: -4974468161004867859, guid: 2c37fc2f835f24f8b96b0f8d5bbb09ff, type: 3}
    material: {fileID: 2100000, guid: ba518f2c0e9854fc399005788adb5e52, type: 2}
  - mesh: {fileID: -4974468161004867859, guid: 2c37fc2f835f24f8b96b0f8d5bbb09ff, type: 3}
    material: {fileID: 2100000, guid: ba518f2c0e9854fc399005788adb5e52, type: 2}
  - mesh: {fileID: -4974468161004867859, guid: 2c37fc2f835f24f8b96b0f8d5bbb09ff, type: 3}
    material: {fileID: 2100000, guid: ba518f2c0e9854fc399005788adb5e52, type: 2}
  - mesh: {fileID: -4974468161004867859, guid: 2c37fc2f835f24f8b96b0f8d5bbb09ff, type: 3}
    material: {fileID: 2100000, guid: ba518f2c0e9854fc399005788adb5e52, type: 2}
  - mesh: {fileID: -4974468161004867859, guid: 2c37fc2f835f24f8b96b0f8d5bbb09ff, type: 3}
    material: {fileID: 2100000, guid: ba518f2c0e9854fc399005788adb5e52, type: 2}
  - mesh: {fileID: -4974468161004867859, guid: 2c37fc2f835f24f8b96b0f8d5bbb09ff, type: 3}
    material: {fileID: 2100000, guid: ba518f2c0e9854fc399005788adb5e52, type: 2}
  - mesh: {fileID: -4974468161004867859, guid: 2c37fc2f835f24f8b96b0f8d5bbb09ff, type: 3}
    material: {fileID: 2100000, guid: ba518f2c0e9854fc399005788adb5e52, type: 2}
  - mesh: {fileID: -4974468161004867859, guid: 2c37fc2f835f24f8b96b0f8d5bbb09ff, type: 3}
    material: {fileID: 2100000, guid: ba518f2c0e9854fc399005788adb5e52, type: 2}
  - mesh: {fileID: -4974468161004867859, guid: 2c37fc2f835f24f8b96b0f8d5bbb09ff, type: 3}
    material: {fileID: 2100000, guid: ba518f2c0e9854fc399005788adb5e52, type: 2}
  - mesh: {fileID: -4974468161004867859, guid: 2c37fc2f835f24f8b96b0f8d5bbb09ff, type: 3}
    material: {fileID: 2100000, guid: ba518f2c0e9854fc399005788adb5e52, type: 2}
  - mesh: {fileID: -4974468161004867859, guid: 2c37fc2f835f24f8b96b0f8d5bbb09ff, type: 3}
    material: {fileID: 2100000, guid: ba518f2c0e9854fc399005788adb5e52, type: 2}
  - mesh: {fileID: -4974468161004867859, guid: 2c37fc2f835f24f8b96b0f8d5bbb09ff, type: 3}
    material: {fileID: 2100000, guid: ba518f2c0e9854fc399005788adb5e52, type: 2}
  - mesh: {fileID: -4974468161004867859, guid: 2c37fc2f835f24f8b96b0f8d5bbb09ff, type: 3}
    material: {fileID: 2100000, guid: ba518f2c0e9854fc399005788adb5e52, type: 2}
  - mesh: {fileID: -4974468161004867859, guid: 2c37fc2f835f24f8b96b0f8d5bbb09ff, type: 3}
    material: {fileID: 2100000, guid: ba518f2c0e9854fc399005788adb5e52, type: 2}
  - mesh: {fileID: -4974468161004867859, guid: 2c37fc2f835f24f8b96b0f8d5bbb09ff, type: 3}
    material: {fileID: 2100000, guid: ba518f2c0e9854fc399005788adb5e52, type: 2}
  - mesh: {fileID: -4974468161004867859, guid: 2c37fc2f835f24f8b96b0f8d5bbb09ff, type: 3}
    material: {fileID: 2100000, guid: ba518f2c0e9854fc399005788adb5e52, type: 2}
  - mesh: {fileID: -4974468161004867859, guid: 2c37fc2f835f24f8b96b0f8d5bbb09ff, type: 3}
    material: {fileID: 2100000, guid: ba518f2c0e9854fc399005788adb5e52, type: 2}
  - mesh: {fileID: -4974468161004867859, guid: 2c37fc2f835f24f8b96b0f8d5bbb09ff, type: 3}
    material: {fileID: 2100000, guid: ba518f2c0e9854fc399005788adb5e52, type: 2}
  - mesh: {fileID: -4974468161004867859, guid: 2c37fc2f835f24f8b96b0f8d5bbb09ff, type: 3}
    material: {fileID: 2100000, guid: ba518f2c0e9854fc399005788adb5e52, type: 2}
  - mesh: {fileID: -4974468161004867859, guid: 2c37fc2f835f24f8b96b0f8d5bbb09ff, type: 3}
    material: {fileID: 2100000, guid: ba518f2c0e9854fc399005788adb5e52, type: 2}
  - mesh: {fileID: -4974468161004867859, guid: 2c37fc2f835f24f8b96b0f8d5bbb09ff, type: 3}
    material: {fileID: 2100000, guid: ba518f2c0e9854fc399005788adb5e52, type: 2}
  - mesh: {fileID: -4974468161004867859, guid: 2c37fc2f835f24f8b96b0f8d5bbb09ff, type: 3}
    material: {fileID: 2100000, guid: ba518f2c0e9854fc399005788adb5e52, type: 2}
  - mesh: {fileID: -4974468161004867859, guid: 2c37fc2f835f24f8b96b0f8d5bbb09ff, type: 3}
    material: {fileID: 2100000, guid: ba518f2c0e9854fc399005788adb5e52, type: 2}
  - mesh: {fileID: -4974468161004867859, guid: 2c37fc2f835f24f8b96b0f8d5bbb09ff, type: 3}
    material: {fileID: 2100000, guid: ba518f2c0e9854fc399005788adb5e52, type: 2}
  - mesh: {fileID: -4974468161004867859, guid: 2c37fc2f835f24f8b96b0f8d5bbb09ff, type: 3}
    material: {fileID: 2100000, guid: ba518f2c0e9854fc399005788adb5e52, type: 2}
  - mesh: {fileID: -4974468161004867859, guid: 2c37fc2f835f24f8b96b0f8d5bbb09ff, type: 3}
    material: {fileID: 2100000, guid: ba518f2c0e9854fc399005788adb5e52, type: 2}
  - mesh: {fileID: -4974468161004867859, guid: 2c37fc2f835f24f8b96b0f8d5bbb09ff, type: 3}
    material: {fileID: 2100000, guid: ba518f2c0e9854fc399005788adb5e52, type: 2}
  - mesh: {fileID: -4974468161004867859, guid: 2c37fc2f835f24f8b96b0f8d5bbb09ff, type: 3}
    material: {fileID: 2100000, guid: ba518f2c0e9854fc399005788adb5e52, type: 2}
  - mesh: {fileID: -4974468161004867859, guid: 2c37fc2f835f24f8b96b0f8d5bbb09ff, type: 3}
    material: {fileID: 2100000, guid: ba518f2c0e9854fc399005788adb5e52, type: 2}
  - mesh: {fileID: -4974468161004867859, guid: 2c37fc2f835f24f8b96b0f8d5bbb09ff, type: 3}
    material: {fileID: 2100000, guid: ba518f2c0e9854fc399005788adb5e52, type: 2}
  - mesh: {fileID: -4974468161004867859, guid: 2c37fc2f835f24f8b96b0f8d5bbb09ff, type: 3}
    material: {fileID: 2100000, guid: ba518f2c0e9854fc399005788adb5e52, type: 2}
  - mesh: {fileID: -4974468161004867859, guid: 2c37fc2f835f24f8b96b0f8d5bbb09ff, type: 3}
    material: {fileID: 2100000, guid: ba518f2c0e9854fc399005788adb5e52, type: 2}
  - mesh: {fileID: -4974468161004867859, guid: 2c37fc2f835f24f8b96b0f8d5bbb09ff, type: 3}
    material: {fileID: 2100000, guid: ba518f2c0e9854fc399005788adb5e52, type: 2}
  - mesh: {fileID: -4974468161004867859, guid: 2c37fc2f835f24f8b96b0f8d5bbb09ff, type: 3}
    material: {fileID: 2100000, guid: ba518f2c0e9854fc399005788adb5e52, type: 2}
  - mesh: {fileID: -4974468161004867859, guid: 2c37fc2f835f24f8b96b0f8d5bbb09ff, type: 3}
    material: {fileID: 2100000, guid: ba518f2c0e9854fc399005788adb5e52, type: 2}
  - mesh: {fileID: -4974468161004867859, guid: 2c37fc2f835f24f8b96b0f8d5bbb09ff, type: 3}
    material: {fileID: 2100000, guid: ba518f2c0e9854fc399005788adb5e52, type: 2}
  - mesh: {fileID: -4974468161004867859, guid: 2c37fc2f835f24f8b96b0f8d5bbb09ff, type: 3}
    material: {fileID: 2100000, guid: ba518f2c0e9854fc399005788adb5e52, type: 2}
  - mesh: {fileID: -4974468161004867859, guid: 2c37fc2f835f24f8b96b0f8d5bbb09ff, type: 3}
    material: {fileID: 2100000, guid: ba518f2c0e9854fc399005788adb5e52, type: 2}
  - mesh: {fileID: -4974468161004867859, guid: 2c37fc2f835f24f8b96b0f8d5bbb09ff, type: 3}
    material: {fileID: 2100000, guid: ba518f2c0e9854fc399005788adb5e52, type: 2}
  - mesh: {fileID: -4974468161004867859, guid: 2c37fc2f835f24f8b96b0f8d5bbb09ff, type: 3}
    material: {fileID: 2100000, guid: ba518f2c0e9854fc399005788adb5e52, type: 2}
  - mesh: {fileID: -4974468161004867859, guid: 2c37fc2f835f24f8b96b0f8d5bbb09ff, type: 3}
    material: {fileID: 2100000, guid: ba518f2c0e9854fc399005788adb5e52, type: 2}
  - mesh: {fileID: -4974468161004867859, guid: 2c37fc2f835f24f8b96b0f8d5bbb09ff, type: 3}
    material: {fileID: 2100000, guid: ba518f2c0e9854fc399005788adb5e52, type: 2}
  - mesh: {fileID: -4974468161004867859, guid: 2c37fc2f835f24f8b96b0f8d5bbb09ff, type: 3}
    material: {fileID: 2100000, guid: ba518f2c0e9854fc399005788adb5e52, type: 2}
  - mesh: {fileID: -4974468161004867859, guid: 2c37fc2f835f24f8b96b0f8d5bbb09ff, type: 3}
    material: {fileID: 2100000, guid: ba518f2c0e9854fc399005788adb5e52, type: 2}
  - mesh: {fileID: -4974468161004867859, guid: 2c37fc2f835f24f8b96b0f8d5bbb09ff, type: 3}
    material: {fileID: 2100000, guid: ba518f2c0e9854fc399005788adb5e52, type: 2}
  - mesh: {fileID: -4974468161004867859, guid: 2c37fc2f835f24f8b96b0f8d5bbb09ff, type: 3}
    material: {fileID: 2100000, guid: ba518f2c0e9854fc399005788adb5e52, type: 2}
  - mesh: {fileID: -4974468161004867859, guid: 2c37fc2f835f24f8b96b0f8d5bbb09ff, type: 3}
    material: {fileID: 2100000, guid: ba518f2c0e9854fc399005788adb5e52, type: 2}
  - mesh: {fileID: -4974468161004867859, guid: 2c37fc2f835f24f8b96b0f8d5bbb09ff, type: 3}
    material: {fileID: 2100000, guid: ba518f2c0e9854fc399005788adb5e52, type: 2}
  - mesh: {fileID: -4974468161004867859, guid: 2c37fc2f835f24f8b96b0f8d5bbb09ff, type: 3}
    material: {fileID: 2100000, guid: ba518f2c0e9854fc399005788adb5e52, type: 2}
  - mesh: {fileID: -4974468161004867859, guid: 2c37fc2f835f24f8b96b0f8d5bbb09ff, type: 3}
    material: {fileID: 2100000, guid: ba518f2c0e9854fc399005788adb5e52, type: 2}
  - mesh: {fileID: -4974468161004867859, guid: 2c37fc2f835f24f8b96b0f8d5bbb09ff, type: 3}
    material: {fileID: 2100000, guid: ba518f2c0e9854fc399005788adb5e52, type: 2}
  - mesh: {fileID: -4974468161004867859, guid: 2c37fc2f835f24f8b96b0f8d5bbb09ff, type: 3}
    material: {fileID: 2100000, guid: ba518f2c0e9854fc399005788adb5e52, type: 2}
  - mesh: {fileID: -4974468161004867859, guid: 2c37fc2f835f24f8b96b0f8d5bbb09ff, type: 3}
    material: {fileID: 2100000, guid: ba518f2c0e9854fc399005788adb5e52, type: 2}
  - mesh: {fileID: -4974468161004867859, guid: 2c37fc2f835f24f8b96b0f8d5bbb09ff, type: 3}
    material: {fileID: 2100000, guid: ba518f2c0e9854fc399005788adb5e52, type: 2}
  - mesh: {fileID: -4974468161004867859, guid: 2c37fc2f835f24f8b96b0f8d5bbb09ff, type: 3}
    material: {fileID: 2100000, guid: ba518f2c0e9854fc399005788adb5e52, type: 2}
  - mesh: {fileID: -4974468161004867859, guid: 2c37fc2f835f24f8b96b0f8d5bbb09ff, type: 3}
    material: {fileID: 2100000, guid: ba518f2c0e9854fc399005788adb5e52, type: 2}
  - mesh: {fileID: -4974468161004867859, guid: 2c37fc2f835f24f8b96b0f8d5bbb09ff, type: 3}
    material: {fileID: 2100000, guid: ba518f2c0e9854fc399005788adb5e52, type: 2}
  - mesh: {fileID: -4974468161004867859, guid: 2c37fc2f835f24f8b96b0f8d5bbb09ff, type: 3}
    material: {fileID: 2100000, guid: ba518f2c0e9854fc399005788adb5e52, type: 2}
  - mesh: {fileID: -4974468161004867859, guid: 2c37fc2f835f24f8b96b0f8d5bbb09ff, type: 3}
    material: {fileID: 2100000, guid: ba518f2c0e9854fc399005788adb5e52, type: 2}
  - mesh: {fileID: -4974468161004867859, guid: 2c37fc2f835f24f8b96b0f8d5bbb09ff, type: 3}
    material: {fileID: 2100000, guid: ba518f2c0e9854fc399005788adb5e52, type: 2}
  - mesh: {fileID: -4974468161004867859, guid: 2c37fc2f835f24f8b96b0f8d5bbb09ff, type: 3}
    material: {fileID: 2100000, guid: ba518f2c0e9854fc399005788adb5e52, type: 2}
  - mesh: {fileID: -4974468161004867859, guid: 2c37fc2f835f24f8b96b0f8d5bbb09ff, type: 3}
    material: {fileID: 2100000, guid: ba518f2c0e9854fc399005788adb5e52, type: 2}
  - mesh: {fileID: -4974468161004867859, guid: 2c37fc2f835f24f8b96b0f8d5bbb09ff, type: 3}
    material: {fileID: 2100000, guid: ba518f2c0e9854fc399005788adb5e52, type: 2}
  - mesh: {fileID: -4974468161004867859, guid: 2c37fc2f835f24f8b96b0f8d5bbb09ff, type: 3}
    material: {fileID: 2100000, guid: ba518f2c0e9854fc399005788adb5e52, type: 2}
  - mesh: {fileID: -4974468161004867859, guid: 2c37fc2f835f24f8b96b0f8d5bbb09ff, type: 3}
    material: {fileID: 2100000, guid: ba518f2c0e9854fc399005788adb5e52, type: 2}
  - mesh: {fileID: -4974468161004867859, guid: 2c37fc2f835f24f8b96b0f8d5bbb09ff, type: 3}
    material: {fileID: 2100000, guid: ba518f2c0e9854fc399005788adb5e52, type: 2}
  - mesh: {fileID: -4974468161004867859, guid: 2c37fc2f835f24f8b96b0f8d5bbb09ff, type: 3}
    material: {fileID: 2100000, guid: ba518f2c0e9854fc399005788adb5e52, type: 2}
  - mesh: {fileID: -4974468161004867859, guid: 2c37fc2f835f24f8b96b0f8d5bbb09ff, type: 3}
    material: {fileID: 2100000, guid: ba518f2c0e9854fc399005788adb5e52, type: 2}
  - mesh: {fileID: -4974468161004867859, guid: 2c37fc2f835f24f8b96b0f8d5bbb09ff, type: 3}
    material: {fileID: 2100000, guid: ba518f2c0e9854fc399005788adb5e52, type: 2}
  - mesh: {fileID: -4974468161004867859, guid: 2c37fc2f835f24f8b96b0f8d5bbb09ff, type: 3}
    material: {fileID: 2100000, guid: ba518f2c0e9854fc399005788adb5e52, type: 2}
  - mesh: {fileID: -4974468161004867859, guid: 2c37fc2f835f24f8b96b0f8d5bbb09ff, type: 3}
    material: {fileID: 2100000, guid: ba518f2c0e9854fc399005788adb5e52, type: 2}
  - mesh: {fileID: -4974468161004867859, guid: 2c37fc2f835f24f8b96b0f8d5bbb09ff, type: 3}
    material: {fileID: 2100000, guid: ba518f2c0e9854fc399005788adb5e52, type: 2}
  - mesh: {fileID: -4974468161004867859, guid: 2c37fc2f835f24f8b96b0f8d5bbb09ff, type: 3}
    material: {fileID: 2100000, guid: ba518f2c0e9854fc399005788adb5e52, type: 2}
  - mesh: {fileID: -4974468161004867859, guid: 2c37fc2f835f24f8b96b0f8d5bbb09ff, type: 3}
    material: {fileID: 2100000, guid: ba518f2c0e9854fc399005788adb5e52, type: 2}
  - mesh: {fileID: -4974468161004867859, guid: 2c37fc2f835f24f8b96b0f8d5bbb09ff, type: 3}
    material: {fileID: 2100000, guid: ba518f2c0e9854fc399005788adb5e52, type: 2}
  - mesh: {fileID: -4974468161004867859, guid: 2c37fc2f835f24f8b96b0f8d5bbb09ff, type: 3}
    material: {fileID: 2100000, guid: ba518f2c0e9854fc399005788adb5e52, type: 2}
  - mesh: {fileID: -4974468161004867859, guid: 2c37fc2f835f24f8b96b0f8d5bbb09ff, type: 3}
    material: {fileID: 2100000, guid: ba518f2c0e9854fc399005788adb5e52, type: 2}
  - mesh: {fileID: -4974468161004867859, guid: 2c37fc2f835f24f8b96b0f8d5bbb09ff, type: 3}
    material: {fileID: 2100000, guid: ba518f2c0e9854fc399005788adb5e52, type: 2}
  - mesh: {fileID: -4974468161004867859, guid: 2c37fc2f835f24f8b96b0f8d5bbb09ff, type: 3}
    material: {fileID: 2100000, guid: ba518f2c0e9854fc399005788adb5e52, type: 2}
  - mesh: {fileID: -4974468161004867859, guid: 2c37fc2f835f24f8b96b0f8d5bbb09ff, type: 3}
    material: {fileID: 2100000, guid: ba518f2c0e9854fc399005788adb5e52, type: 2}
  - mesh: {fileID: -4974468161004867859, guid: 2c37fc2f835f24f8b96b0f8d5bbb09ff, type: 3}
    material: {fileID: 2100000, guid: ba518f2c0e9854fc399005788adb5e52, type: 2}
  - mesh: {fileID: -4974468161004867859, guid: 2c37fc2f835f24f8b96b0f8d5bbb09ff, type: 3}
    material: {fileID: 2100000, guid: ba518f2c0e9854fc399005788adb5e52, type: 2}
  - mesh: {fileID: -4974468161004867859, guid: 2c37fc2f835f24f8b96b0f8d5bbb09ff, type: 3}
    material: {fileID: 2100000, guid: ba518f2c0e9854fc399005788adb5e52, type: 2}
  - mesh: {fileID: -4974468161004867859, guid: 2c37fc2f835f24f8b96b0f8d5bbb09ff, type: 3}
    material: {fileID: 2100000, guid: ba518f2c0e9854fc399005788adb5e52, type: 2}
  - mesh: {fileID: -4974468161004867859, guid: 2c37fc2f835f24f8b96b0f8d5bbb09ff, type: 3}
    material: {fileID: 2100000, guid: ba518f2c0e9854fc399005788adb5e52, type: 2}
  - mesh: {fileID: -4974468161004867859, guid: 2c37fc2f835f24f8b96b0f8d5bbb09ff, type: 3}
    material: {fileID: 2100000, guid: ba518f2c0e9854fc399005788adb5e52, type: 2}
  - mesh: {fileID: -4974468161004867859, guid: 2c37fc2f835f24f8b96b0f8d5bbb09ff, type: 3}
    material: {fileID: 2100000, guid: ba518f2c0e9854fc399005788adb5e52, type: 2}
  - mesh: {fileID: -4974468161004867859, guid: 2c37fc2f835f24f8b96b0f8d5bbb09ff, type: 3}
    material: {fileID: 2100000, guid: ba518f2c0e9854fc399005788adb5e52, type: 2}
  - mesh: {fileID: -4974468161004867859, guid: 2c37fc2f835f24f8b96b0f8d5bbb09ff, type: 3}
    material: {fileID: 2100000, guid: ba518f2c0e9854fc399005788adb5e52, type: 2}
  - mesh: {fileID: -4974468161004867859, guid: 2c37fc2f835f24f8b96b0f8d5bbb09ff, type: 3}
    material: {fileID: 2100000, guid: ba518f2c0e9854fc399005788adb5e52, type: 2}
  - mesh: {fileID: -4974468161004867859, guid: 2c37fc2f835f24f8b96b0f8d5bbb09ff, type: 3}
    material: {fileID: 2100000, guid: ba518f2c0e9854fc399005788adb5e52, type: 2}
  - mesh: {fileID: -4974468161004867859, guid: 2c37fc2f835f24f8b96b0f8d5bbb09ff, type: 3}
    material: {fileID: 2100000, guid: ba518f2c0e9854fc399005788adb5e52, type: 2}
  - mesh: {fileID: -4974468161004867859, guid: 2c37fc2f835f24f8b96b0f8d5bbb09ff, type: 3}
    material: {fileID: 2100000, guid: ba518f2c0e9854fc399005788adb5e52, type: 2}
  - mesh: {fileID: -4974468161004867859, guid: 2c37fc2f835f24f8b96b0f8d5bbb09ff, type: 3}
    material: {fileID: 2100000, guid: ba518f2c0e9854fc399005788adb5e52, type: 2}
  - mesh: {fileID: -4974468161004867859, guid: 2c37fc2f835f24f8b96b0f8d5bbb09ff, type: 3}
    material: {fileID: 2100000, guid: ba518f2c0e9854fc399005788adb5e52, type: 2}
  - mesh: {fileID: -4974468161004867859, guid: 2c37fc2f835f24f8b96b0f8d5bbb09ff, type: 3}
    material: {fileID: 2100000, guid: ba518f2c0e9854fc399005788adb5e52, type: 2}
  - mesh: {fileID: -4974468161004867859, guid: 2c37fc2f835f24f8b96b0f8d5bbb09ff, type: 3}
    material: {fileID: 2100000, guid: ba518f2c0e9854fc399005788adb5e52, type: 2}
  - mesh: {fileID: -4974468161004867859, guid: 2c37fc2f835f24f8b96b0f8d5bbb09ff, type: 3}
    material: {fileID: 2100000, guid: ba518f2c0e9854fc399005788adb5e52, type: 2}
  - mesh: {fileID: -4974468161004867859, guid: 2c37fc2f835f24f8b96b0f8d5bbb09ff, type: 3}
    material: {fileID: 2100000, guid: ba518f2c0e9854fc399005788adb5e52, type: 2}
  - mesh: {fileID: -4974468161004867859, guid: 2c37fc2f835f24f8b96b0f8d5bbb09ff, type: 3}
    material: {fileID: 2100000, guid: ba518f2c0e9854fc399005788adb5e52, type: 2}
  - mesh: {fileID: -4974468161004867859, guid: 2c37fc2f835f24f8b96b0f8d5bbb09ff, type: 3}
    material: {fileID: 2100000, guid: ba518f2c0e9854fc399005788adb5e52, type: 2}
  - mesh: {fileID: -4974468161004867859, guid: 2c37fc2f835f24f8b96b0f8d5bbb09ff, type: 3}
    material: {fileID: 2100000, guid: ba518f2c0e9854fc399005788adb5e52, type: 2}
  - mesh: {fileID: -4974468161004867859, guid: 2c37fc2f835f24f8b96b0f8d5bbb09ff, type: 3}
    material: {fileID: 2100000, guid: ba518f2c0e9854fc399005788adb5e52, type: 2}
  - mesh: {fileID: -4974468161004867859, guid: 2c37fc2f835f24f8b96b0f8d5bbb09ff, type: 3}
    material: {fileID: 2100000, guid: ba518f2c0e9854fc399005788adb5e52, type: 2}
  - mesh: {fileID: -4974468161004867859, guid: 2c37fc2f835f24f8b96b0f8d5bbb09ff, type: 3}
    material: {fileID: 2100000, guid: ba518f2c0e9854fc399005788adb5e52, type: 2}
  - mesh: {fileID: -4974468161004867859, guid: 2c37fc2f835f24f8b96b0f8d5bbb09ff, type: 3}
    material: {fileID: 2100000, guid: ba518f2c0e9854fc399005788adb5e52, type: 2}
  - mesh: {fileID: -4974468161004867859, guid: 2c37fc2f835f24f8b96b0f8d5bbb09ff, type: 3}
    material: {fileID: 2100000, guid: ba518f2c0e9854fc399005788adb5e52, type: 2}
  - mesh: {fileID: -4974468161004867859, guid: 2c37fc2f835f24f8b96b0f8d5bbb09ff, type: 3}
    material: {fileID: 2100000, guid: ba518f2c0e9854fc399005788adb5e52, type: 2}
  - mesh: {fileID: -4974468161004867859, guid: 2c37fc2f835f24f8b96b0f8d5bbb09ff, type: 3}
    material: {fileID: 2100000, guid: ba518f2c0e9854fc399005788adb5e52, type: 2}
  - mesh: {fileID: -4974468161004867859, guid: 2c37fc2f835f24f8b96b0f8d5bbb09ff, type: 3}
    material: {fileID: 2100000, guid: ba518f2c0e9854fc399005788adb5e52, type: 2}
  - mesh: {fileID: -4974468161004867859, guid: 2c37fc2f835f24f8b96b0f8d5bbb09ff, type: 3}
    material: {fileID: 2100000, guid: ba518f2c0e9854fc399005788adb5e52, type: 2}
  - mesh: {fileID: -4974468161004867859, guid: 2c37fc2f835f24f8b96b0f8d5bbb09ff, type: 3}
    material: {fileID: 2100000, guid: ba518f2c0e9854fc399005788adb5e52, type: 2}
  - mesh: {fileID: -4974468161004867859, guid: 2c37fc2f835f24f8b96b0f8d5bbb09ff, type: 3}
    material: {fileID: 2100000, guid: ba518f2c0e9854fc399005788adb5e52, type: 2}
  - mesh: {fileID: -4974468161004867859, guid: 2c37fc2f835f24f8b96b0f8d5bbb09ff, type: 3}
    material: {fileID: 2100000, guid: ba518f2c0e9854fc399005788adb5e52, type: 2}
  - mesh: {fileID: -4974468161004867859, guid: 2c37fc2f835f24f8b96b0f8d5bbb09ff, type: 3}
    material: {fileID: 2100000, guid: ba518f2c0e9854fc399005788adb5e52, type: 2}
  - mesh: {fileID: -4974468161004867859, guid: 2c37fc2f835f24f8b96b0f8d5bbb09ff, type: 3}
    material: {fileID: 2100000, guid: ba518f2c0e9854fc399005788adb5e52, type: 2}
  - mesh: {fileID: -4974468161004867859, guid: 2c37fc2f835f24f8b96b0f8d5bbb09ff, type: 3}
    material: {fileID: 2100000, guid: ba518f2c0e9854fc399005788adb5e52, type: 2}
  - mesh: {fileID: -4974468161004867859, guid: 2c37fc2f835f24f8b96b0f8d5bbb09ff, type: 3}
    material: {fileID: 2100000, guid: ba518f2c0e9854fc399005788adb5e52, type: 2}
  - mesh: {fileID: -4974468161004867859, guid: 2c37fc2f835f24f8b96b0f8d5bbb09ff, type: 3}
    material: {fileID: 2100000, guid: ba518f2c0e9854fc399005788adb5e52, type: 2}
  - mesh: {fileID: -4974468161004867859, guid: 2c37fc2f835f24f8b96b0f8d5bbb09ff, type: 3}
    material: {fileID: 2100000, guid: ba518f2c0e9854fc399005788adb5e52, type: 2}
  - mesh: {fileID: -4974468161004867859, guid: 2c37fc2f835f24f8b96b0f8d5bbb09ff, type: 3}
    material: {fileID: 2100000, guid: ba518f2c0e9854fc399005788adb5e52, type: 2}
  - mesh: {fileID: -4974468161004867859, guid: 2c37fc2f835f24f8b96b0f8d5bbb09ff, type: 3}
    material: {fileID: 2100000, guid: ba518f2c0e9854fc399005788adb5e52, type: 2}
  - mesh: {fileID: -4974468161004867859, guid: 2c37fc2f835f24f8b96b0f8d5bbb09ff, type: 3}
    material: {fileID: 2100000, guid: ba518f2c0e9854fc399005788adb5e52, type: 2}
  - mesh: {fileID: -4974468161004867859, guid: 2c37fc2f835f24f8b96b0f8d5bbb09ff, type: 3}
    material: {fileID: 2100000, guid: ba518f2c0e9854fc399005788adb5e52, type: 2}
  - mesh: {fileID: -4974468161004867859, guid: 2c37fc2f835f24f8b96b0f8d5bbb09ff, type: 3}
    material: {fileID: 2100000, guid: ba518f2c0e9854fc399005788adb5e52, type: 2}
  - mesh: {fileID: -4974468161004867859, guid: 2c37fc2f835f24f8b96b0f8d5bbb09ff, type: 3}
    material: {fileID: 2100000, guid: ba518f2c0e9854fc399005788adb5e52, type: 2}
  - mesh: {fileID: -4974468161004867859, guid: 2c37fc2f835f24f8b96b0f8d5bbb09ff, type: 3}
    material: {fileID: 2100000, guid: ba518f2c0e9854fc399005788adb5e52, type: 2}
  - mesh: {fileID: -4974468161004867859, guid: 2c37fc2f835f24f8b96b0f8d5bbb09ff, type: 3}
    material: {fileID: 2100000, guid: ba518f2c0e9854fc399005788adb5e52, type: 2}
  - mesh: {fileID: -4974468161004867859, guid: 2c37fc2f835f24f8b96b0f8d5bbb09ff, type: 3}
    material: {fileID: 2100000, guid: ba518f2c0e9854fc399005788adb5e52, type: 2}
  - mesh: {fileID: -4974468161004867859, guid: 2c37fc2f835f24f8b96b0f8d5bbb09ff, type: 3}
    material: {fileID: 2100000, guid: ba518f2c0e9854fc399005788adb5e52, type: 2}
  - mesh: {fileID: -4974468161004867859, guid: 2c37fc2f835f24f8b96b0f8d5bbb09ff, type: 3}
    material: {fileID: 2100000, guid: ba518f2c0e9854fc399005788adb5e52, type: 2}
  - mesh: {fileID: -4974468161004867859, guid: 2c37fc2f835f24f8b96b0f8d5bbb09ff, type: 3}
    material: {fileID: 2100000, guid: ba518f2c0e9854fc399005788adb5e52, type: 2}
  - mesh: {fileID: -4974468161004867859, guid: 2c37fc2f835f24f8b96b0f8d5bbb09ff, type: 3}
    material: {fileID: 2100000, guid: ba518f2c0e9854fc399005788adb5e52, type: 2}
  - mesh: {fileID: -4974468161004867859, guid: 2c37fc2f835f24f8b96b0f8d5bbb09ff, type: 3}
    material: {fileID: 2100000, guid: ba518f2c0e9854fc399005788adb5e52, type: 2}
  - mesh: {fileID: -4974468161004867859, guid: 2c37fc2f835f24f8b96b0f8d5bbb09ff, type: 3}
    material: {fileID: 2100000, guid: ba518f2c0e9854fc399005788adb5e52, type: 2}
  - mesh: {fileID: -4974468161004867859, guid: 2c37fc2f835f24f8b96b0f8d5bbb09ff, type: 3}
    material: {fileID: 2100000, guid: ba518f2c0e9854fc399005788adb5e52, type: 2}
  - mesh: {fileID: -4974468161004867859, guid: 2c37fc2f835f24f8b96b0f8d5bbb09ff, type: 3}
    material: {fileID: 2100000, guid: ba518f2c0e9854fc399005788adb5e52, type: 2}
  - mesh: {fileID: -4974468161004867859, guid: 2c37fc2f835f24f8b96b0f8d5bbb09ff, type: 3}
    material: {fileID: 2100000, guid: ba518f2c0e9854fc399005788adb5e52, type: 2}
  - mesh: {fileID: -4974468161004867859, guid: 2c37fc2f835f24f8b96b0f8d5bbb09ff, type: 3}
    material: {fileID: 2100000, guid: ba518f2c0e9854fc399005788adb5e52, type: 2}
  - mesh: {fileID: -4974468161004867859, guid: 2c37fc2f835f24f8b96b0f8d5bbb09ff, type: 3}
    material: {fileID: 2100000, guid: ba518f2c0e9854fc399005788adb5e52, type: 2}
  - mesh: {fileID: -4974468161004867859, guid: 2c37fc2f835f24f8b96b0f8d5bbb09ff, type: 3}
    material: {fileID: 2100000, guid: ba518f2c0e9854fc399005788adb5e52, type: 2}
  - mesh: {fileID: -4974468161004867859, guid: 2c37fc2f835f24f8b96b0f8d5bbb09ff, type: 3}
    material: {fileID: 2100000, guid: ba518f2c0e9854fc399005788adb5e52, type: 2}
  - mesh: {fileID: -4974468161004867859, guid: 2c37fc2f835f24f8b96b0f8d5bbb09ff, type: 3}
    material: {fileID: 2100000, guid: ba518f2c0e9854fc399005788adb5e52, type: 2}
  - mesh: {fileID: -4974468161004867859, guid: 2c37fc2f835f24f8b96b0f8d5bbb09ff, type: 3}
    material: {fileID: 2100000, guid: ba518f2c0e9854fc399005788adb5e52, type: 2}
  - mesh: {fileID: -4974468161004867859, guid: 2c37fc2f835f24f8b96b0f8d5bbb09ff, type: 3}
    material: {fileID: 2100000, guid: ba518f2c0e9854fc399005788adb5e52, type: 2}
  - mesh: {fileID: -4974468161004867859, guid: 2c37fc2f835f24f8b96b0f8d5bbb09ff, type: 3}
    material: {fileID: 2100000, guid: ba518f2c0e9854fc399005788adb5e52, type: 2}
  - mesh: {fileID: -4974468161004867859, guid: 2c37fc2f835f24f8b96b0f8d5bbb09ff, type: 3}
    material: {fileID: 2100000, guid: ba518f2c0e9854fc399005788adb5e52, type: 2}
  - mesh: {fileID: -4974468161004867859, guid: 2c37fc2f835f24f8b96b0f8d5bbb09ff, type: 3}
    material: {fileID: 2100000, guid: ba518f2c0e9854fc399005788adb5e52, type: 2}
  - mesh: {fileID: -4974468161004867859, guid: 2c37fc2f835f24f8b96b0f8d5bbb09ff, type: 3}
    material: {fileID: 2100000, guid: ba518f2c0e9854fc399005788adb5e52, type: 2}
  - mesh: {fileID: -4974468161004867859, guid: 2c37fc2f835f24f8b96b0f8d5bbb09ff, type: 3}
    material: {fileID: 2100000, guid: ba518f2c0e9854fc399005788adb5e52, type: 2}
  - mesh: {fileID: -4974468161004867859, guid: 2c37fc2f835f24f8b96b0f8d5bbb09ff, type: 3}
    material: {fileID: 2100000, guid: ba518f2c0e9854fc399005788adb5e52, type: 2}
  - mesh: {fileID: -4974468161004867859, guid: 2c37fc2f835f24f8b96b0f8d5bbb09ff, type: 3}
    material: {fileID: 2100000, guid: ba518f2c0e9854fc399005788adb5e52, type: 2}
  - mesh: {fileID: -4974468161004867859, guid: 2c37fc2f835f24f8b96b0f8d5bbb09ff, type: 3}
    material: {fileID: 2100000, guid: ba518f2c0e9854fc399005788adb5e52, type: 2}
  - mesh: {fileID: -4974468161004867859, guid: 2c37fc2f835f24f8b96b0f8d5bbb09ff, type: 3}
    material: {fileID: 2100000, guid: ba518f2c0e9854fc399005788adb5e52, type: 2}
  - mesh: {fileID: -4974468161004867859, guid: 2c37fc2f835f24f8b96b0f8d5bbb09ff, type: 3}
    material: {fileID: 2100000, guid: ba518f2c0e9854fc399005788adb5e52, type: 2}
  - mesh: {fileID: -4974468161004867859, guid: 2c37fc2f835f24f8b96b0f8d5bbb09ff, type: 3}
    material: {fileID: 2100000, guid: ba518f2c0e9854fc399005788adb5e52, type: 2}
  - mesh: {fileID: -4974468161004867859, guid: 2c37fc2f835f24f8b96b0f8d5bbb09ff, type: 3}
    material: {fileID: 2100000, guid: ba518f2c0e9854fc399005788adb5e52, type: 2}
  - mesh: {fileID: -4974468161004867859, guid: 2c37fc2f835f24f8b96b0f8d5bbb09ff, type: 3}
    material: {fileID: 2100000, guid: ba518f2c0e9854fc399005788adb5e52, type: 2}
  - mesh: {fileID: -4974468161004867859, guid: 2c37fc2f835f24f8b96b0f8d5bbb09ff, type: 3}
    material: {fileID: 2100000, guid: ba518f2c0e9854fc399005788adb5e52, type: 2}
  - mesh: {fileID: -4974468161004867859, guid: 2c37fc2f835f24f8b96b0f8d5bbb09ff, type: 3}
    material: {fileID: 2100000, guid: ba518f2c0e9854fc399005788adb5e52, type: 2}
  - mesh: {fileID: -4974468161004867859, guid: 2c37fc2f835f24f8b96b0f8d5bbb09ff, type: 3}
    material: {fileID: 2100000, guid: ba518f2c0e9854fc399005788adb5e52, type: 2}
  - mesh: {fileID: -4974468161004867859, guid: 2c37fc2f835f24f8b96b0f8d5bbb09ff, type: 3}
    material: {fileID: 2100000, guid: ba518f2c0e9854fc399005788adb5e52, type: 2}
  - mesh: {fileID: -4974468161004867859, guid: 2c37fc2f835f24f8b96b0f8d5bbb09ff, type: 3}
    material: {fileID: 2100000, guid: ba518f2c0e9854fc399005788adb5e52, type: 2}
  - mesh: {fileID: -4974468161004867859, guid: 2c37fc2f835f24f8b96b0f8d5bbb09ff, type: 3}
    material: {fileID: 2100000, guid: ba518f2c0e9854fc399005788adb5e52, type: 2}
  - mesh: {fileID: -4974468161004867859, guid: 2c37fc2f835f24f8b96b0f8d5bbb09ff, type: 3}
    material: {fileID: 2100000, guid: ba518f2c0e9854fc399005788adb5e52, type: 2}
  - mesh: {fileID: -4974468161004867859, guid: 2c37fc2f835f24f8b96b0f8d5bbb09ff, type: 3}
    material: {fileID: 2100000, guid: ba518f2c0e9854fc399005788adb5e52, type: 2}
  - mesh: {fileID: -4974468161004867859, guid: 2c37fc2f835f24f8b96b0f8d5bbb09ff, type: 3}
    material: {fileID: 2100000, guid: ba518f2c0e9854fc399005788adb5e52, type: 2}
  - mesh: {fileID: -4974468161004867859, guid: 2c37fc2f835f24f8b96b0f8d5bbb09ff, type: 3}
    material: {fileID: 2100000, guid: ba518f2c0e9854fc399005788adb5e52, type: 2}
  - mesh: {fileID: -4974468161004867859, guid: 2c37fc2f835f24f8b96b0f8d5bbb09ff, type: 3}
    material: {fileID: 2100000, guid: ba518f2c0e9854fc399005788adb5e52, type: 2}
  - mesh: {fileID: -4974468161004867859, guid: 2c37fc2f835f24f8b96b0f8d5bbb09ff, type: 3}
    material: {fileID: 2100000, guid: ba518f2c0e9854fc399005788adb5e52, type: 2}
  - mesh: {fileID: -4974468161004867859, guid: 2c37fc2f835f24f8b96b0f8d5bbb09ff, type: 3}
    material: {fileID: 2100000, guid: ba518f2c0e9854fc399005788adb5e52, type: 2}
  - mesh: {fileID: -4974468161004867859, guid: 2c37fc2f835f24f8b96b0f8d5bbb09ff, type: 3}
    material: {fileID: 2100000, guid: ba518f2c0e9854fc399005788adb5e52, type: 2}
  - mesh: {fileID: -4974468161004867859, guid: 2c37fc2f835f24f8b96b0f8d5bbb09ff, type: 3}
    material: {fileID: 2100000, guid: ba518f2c0e9854fc399005788adb5e52, type: 2}
  - mesh: {fileID: -4974468161004867859, guid: 2c37fc2f835f24f8b96b0f8d5bbb09ff, type: 3}
    material: {fileID: 2100000, guid: ba518f2c0e9854fc399005788adb5e52, type: 2}
  - mesh: {fileID: -4974468161004867859, guid: 2c37fc2f835f24f8b96b0f8d5bbb09ff, type: 3}
    material: {fileID: 2100000, guid: ba518f2c0e9854fc399005788adb5e52, type: 2}
