%YAML 1.1
%TAG !u! tag:unity3d.com,2011:
--- !u!1045 &1
EditorBuildSettings:
  m_ObjectHideFlags: 0
  serializedVersion: 2
  m_Scenes:
  - enabled: 1
    path: Assets/_Project/Scenes/Levels/Level 1/Lvl 1 Menu Intro.unity
    guid: ea4b360fe67be1747b3a2e5b1c076bcf
  - enabled: 1
    path: Assets/_Project/Scenes/Levels/Level 1/Level 1.unity
    guid: ac575c941eea8e24e9d528a9fdd875ef
  - enabled: 1
    path: Assets/_Project/Scenes/Levels/Level 1/Lvl 1 Menu Lose.unity
    guid: bd57c84d40edd7d42a056a862d60193b
  - enabled: 1
    path: Assets/_Project/Scenes/Levels/Level 1/Lvl 1 Menu Win.unity
    guid: 903383c2f2caa4140b856ee5f6e2b273
  m_configObjects: {}
