%YAML 1.1
%TAG !u! tag:unity3d.com,2011:
--- !u!114 &11400000
MonoBehaviour:
  m_ObjectHideFlags: 0
  m_CorrespondingSourceObject: {fileID: 0}
  m_PrefabInstance: {fileID: 0}
  m_PrefabAsset: {fileID: 0}
  m_GameObject: {fileID: 0}
  m_Enabled: 1
  m_EditorHideFlags: 0
  m_Script: {fileID: 11500000, guid: 4816ce2e8f1bd80409a59d985213255a, type: 3}
  m_Name: EnemyAlert_1
  m_EditorClassIdentifier: 
  Name: EnemyAlert_1
  InitialValue: 0
  UseUI: 0
  UIPrefab: {fileID: 8322339850511969721, guid: 1e390fdd61cd5fd43ba3755270f39a9a,
    type: 3}
