0 Untitled Model
0 Name:  pines
0 Author:  
0 CustomBrick
0 NumOfBricks:  27
1 2 -60.000000 -8.000000 -60.000000 1.000000 0.000000 0.000000 0.000000 1.000000 0.000000 0.000000 0.000000 1.000000 3471.dat
1 2 20.000000 -8.000000 -60.000000 1.000000 0.000000 0.000000 0.000000 1.000000 0.000000 0.000000 0.000000 1.000000 2435.dat
1 330 100.000000 -8.000000 100.000000 1.000000 0.000000 0.000000 0.000000 1.000000 0.000000 0.000000 0.000000 1.000000 60474.dat
1 330 -60.000000 -8.000000 100.000000 1.000000 0.000000 0.000000 0.000000 1.000000 0.000000 0.000000 0.000000 1.000000 60474.dat
1 330 -60.000000 -8.000000 260.000000 1.000000 0.000000 0.000000 0.000000 1.000000 0.000000 0.000000 0.000000 1.000000 60474.dat
1 330 100.000000 -8.000000 260.000000 1.000000 0.000000 0.000000 0.000000 1.000000 0.000000 0.000000 0.000000 1.000000 60474.dat
1 10 -69.958220 -24.000000 109.763700 0.856892 0.000000 -0.515496 0.000000 1.000000 0.000000 0.515496 0.000000 0.856892 6255.dat
1 2 -69.958220 -40.000000 109.763700 0.515496 0.000000 0.856892 0.000000 1.000000 0.000000 -0.856892 0.000000 0.515496 6255.dat
1 2 -49.767390 -32.000000 90.079080 0.642983 0.000000 0.765880 0.000000 1.000000 0.000000 -0.765880 0.000000 0.642983 30176.dat
1 2 -90.232600 -32.000000 89.920930 -0.765880 0.000000 0.642983 0.000000 1.000000 0.000000 -0.642983 0.000000 -0.765880 30176.dat
1 2 70.000000 -16.000000 110.000000 1.000000 0.000000 0.000000 0.000000 1.000000 0.000000 0.000000 0.000000 1.000000 2423.dat
1 2 90.000010 -16.000000 110.000000 0.000000 0.000000 -1.000000 0.000000 1.000000 0.000000 1.000000 0.000000 0.000000 2423.dat
1 2 110.079100 -32.000000 69.767390 0.642983 0.000000 0.765880 0.000000 1.000000 0.000000 -0.765880 0.000000 0.642983 30176.dat
1 2 89.920920 -32.000000 130.232600 -0.642984 0.000000 -0.765880 0.000000 1.000000 0.000000 0.765880 0.000000 -0.642984 30176.dat
1 330 110.000000 -40.000000 70.000000 -1.000000 0.000000 0.000000 0.000000 1.000000 0.000000 0.000000 0.000000 -1.000000 2423.dat
1 10 90.000000 -40.000000 130.000000 -1.000000 0.000000 0.000000 0.000000 1.000000 0.000000 0.000000 0.000000 -1.000000 32607.dat
1 10 89.999980 -48.000000 110.000000 0.000000 0.000000 -1.000000 0.000000 1.000000 0.000000 1.000000 0.000000 0.000000 2417.dat
1 330 70.000000 -16.000000 110.000000 1.000000 0.000000 0.000000 0.000000 1.000000 0.000000 0.000000 0.000000 1.000000 15279.dat
1 2 -80.000000 -8.000000 260.000000 1.000000 0.000000 0.000000 0.000000 1.000000 0.000000 0.000000 0.000000 1.000000 6064.dat
1 2 -30.000000 -16.000000 270.000000 1.000000 0.000000 0.000000 0.000000 1.000000 0.000000 0.000000 0.000000 1.000000 2423.dat
1 10 -30.000000 -16.000000 270.000000 0.875465 0.000000 -0.483281 0.000000 1.000000 0.000000 0.483281 0.000000 0.875465 15279.dat
1 330 -50.000000 -8.000000 290.000000 -0.819150 0.000000 -0.573579 0.000000 1.000000 0.000000 0.573579 0.000000 -0.819150 15279.dat
1 10 -69.721950 -40.000000 109.805500 0.707107 0.000000 0.707107 0.000000 1.000000 0.000000 -0.707107 0.000000 0.707107 15279.dat
1 0 110.000000 -8.000000 250.000000 1.000000 0.000000 0.000000 0.000000 1.000000 0.000000 0.000000 0.000000 1.000000 29111.dat
1 2 90.041780 -24.000000 269.763700 0.856892 0.000000 -0.515496 0.000000 1.000000 0.000000 0.515496 0.000000 0.856892 6255.dat
1 2 89.763740 -40.000000 269.958200 0.515494 0.000000 0.856893 0.000000 1.000000 0.000000 -0.856893 0.000000 0.515494 6255.dat
1 2 90.236290 -56.000000 270.041700 -0.515493 0.000000 -0.856894 0.000000 1.000000 0.000000 0.856894 0.000000 -0.515493 6255.dat
