<?xml version="1.0" encoding="UTF-8" standalone="no"?>
<svg
   xmlns:dc="http://purl.org/dc/elements/1.1/"
   xmlns:cc="http://creativecommons.org/ns#"
   xmlns:rdf="http://www.w3.org/1999/02/22-rdf-syntax-ns#"
   xmlns:svg="http://www.w3.org/2000/svg"
   xmlns="http://www.w3.org/2000/svg"
   xmlns:sodipodi="http://sodipodi.sourceforge.net/DTD/sodipodi-0.dtd"
   xmlns:inkscape="http://www.inkscape.org/namespaces/inkscape"
   viewBox="0 0 765.90003 757.48999"
   version="1.1"
   id="svg178"
   sodipodi:docname="badge.svg"
   width="765.90002"
   height="757.48999"
   inkscape:version="0.92.2 2405546, 2018-03-11">
  <metadata
     id="metadata184">
    <rdf:RDF>
      <cc:Work
         rdf:about="">
        <dc:format>image/svg+xml</dc:format>
        <dc:type
           rdf:resource="http://purl.org/dc/dcmitype/StillImage" />
        <dc:title>monkey-MLAAR</dc:title>
      </cc:Work>
    </rdf:RDF>
  </metadata>
  <defs
     id="defs182" />
  <sodipodi:namedview
     pagecolor="#ffffff"
     bordercolor="#666666"
     borderopacity="1"
     objecttolerance="10"
     gridtolerance="10"
     guidetolerance="10"
     inkscape:pageopacity="0"
     inkscape:pageshadow="2"
     inkscape:window-width="1920"
     inkscape:window-height="1030"
     id="namedview180"
     showgrid="false"
     fit-margin-top="0"
     fit-margin-left="0"
     fit-margin-right="0"
     fit-margin-bottom="0"
     inkscape:zoom="0.78022975"
     inkscape:cx="578.02463"
     inkscape:cy="276.95435"
     inkscape:window-x="0"
     inkscape:window-y="13"
     inkscape:window-maximized="1"
     inkscape:current-layer="svg178"
     scale-x="1" />
  <title
     id="title2">monkey-MLAAR</title>
  <g
     id="g1188">
    <g
       transform="translate(-71.64,-95.02)"
       id="Monkey"
       style="isolation:isolate">
      <polygon
         points="656.88,505.9 608.99,819.32 547.23,824.78 576.22,768.06 593.86,710.08 593.86,657.15 "
         style="fill:#101010"
         id="polygon4" />
      <polygon
         points="464.51,553.8 454.7,465.57 498.07,465.57 "
         style="fill:#d9caba"
         id="polygon6" />
      <polygon
         points="690.49,188.29 750.15,215.18 801.4,252.99 770.32,234.5 726.62,252.99 "
         style="fill:#525a62"
         id="polygon8" />
      <polygon
         points="690.49,188.29 644.28,334.49 568.65,276.51 602.26,120.23 "
         style="fill:#525a62"
         id="polygon10" />
      <polygon
         points="726.62,252.99 805.61,432.8 837.54,544.97 669.49,405.07 644.28,334.49 "
         style="fill:#293131"
         id="polygon12" />
      <polygon
         points="498.07,465.57 454.7,465.57 513.2,415.15 538.4,445.4 "
         style="fill:#c69470"
         id="polygon14" />
      <polygon
         points="656.88,505.9 586.3,445.4 608.99,417.68 669.49,405.07 "
         style="fill:#b5837a"
         id="polygon16" />
      <polygon
         points="556.05,536.15 538.4,445.4 562.35,445.4 586.3,445.4 "
         style="fill:#ad837a"
         id="polygon18" />
      <polygon
         points="567.11,327.77 540.93,387.43 513.2,415.15 454.7,345.41 "
         style="fill:#84523f"
         id="polygon20" />
      <polygon
         points="608.99,417.68 583.78,387.43 567.11,327.77 630.83,362.22 "
         style="fill:#84523f"
         id="polygon22" />
      <polygon
         points="464.51,553.8 504.38,544.97 467.82,581.52 "
         style="fill:#4b3128"
         id="polygon24" />
      <path
         d="m 591.34,416.42 a 29,29 0 0 0 -29,-29 h 21.43 L 609,417.68 586.3,445.4 h -23.95 a 29,29 0 0 0 28.99,-28.98 z"
         style="fill:#100000"
         id="path26"
         inkscape:connector-curvature="0" />
      <path
         d="m 562.35,387.43 a 29,29 0 1 0 0,58 h -23.94 l -25.21,-30.27 27.73,-27.73 z"
         style="fill:#100000"
         id="path28"
         inkscape:connector-curvature="0" />
      <polygon
         points="556.05,536.15 656.88,505.9 593.86,657.15 "
         style="fill:#182020"
         id="polygon30" />
      <polygon
         points="582.52,703.78 567.11,571.53 593.86,657.15 "
         style="fill:#ccbeaf"
         id="polygon32" />
      <polygon
         points="582.52,703.78 593.86,657.15 593.86,710.08 "
         style="fill:#ccbeaf"
         id="polygon34" />
      <polygon
         points="582.52,703.78 576.22,768.06 558.57,735.29 "
         style="fill:#eedecc"
         id="polygon36" />
      <polygon
         points="513.2,737.81 558.57,735.29 547.23,824.78 "
         style="fill:#eedecc"
         id="polygon38" />
      <polygon
         points="513.2,737.81 547.23,824.78 491.77,852.51 "
         style="fill:#cea493"
         id="polygon40" />
      <polygon
         points="454.7,708.19 567.11,571.53 558.57,735.29 "
         style="fill:#ccbeaf"
         id="polygon42" />
      <polygon
         points="567.11,571.53 582.52,703.78 558.57,735.29 "
         style="fill:#eedecc"
         id="polygon44" />
      <polygon
         points="582.52,703.78 593.86,710.08 576.22,768.06 "
         style="fill:#ccbeaf"
         id="polygon46" />
      <polygon
         points="558.57,735.29 576.22,768.06 547.23,824.78 "
         style="fill:#cea493"
         id="polygon48" />
      <polygon
         points="644.28,334.49 630.83,362.22 567.11,327.77 568.65,276.51 "
         style="fill:#ad837a"
         id="polygon50" />
      <polygon
         points="567.11,327.77 454.7,345.41 568.65,276.51 "
         style="fill:#cea493"
         id="polygon52" />
      <polygon
         points="630.83,362.22 644.28,334.49 669.49,405.07 "
         style="fill:#cea493"
         id="polygon54" />
      <polygon
         points="467.82,581.52 441.36,581.52 454.7,465.57 464.51,553.8 "
         style="fill:#baada0"
         id="polygon56" />
      <polygon
         points=""
         style="fill:#ff0000"
         id="polygon58" />
      <polygon
         points="818.21,297.52 823.25,376.5 805.61,432.8 726.62,252.99 770.32,234.5 801.4,252.99 "
         style="fill:#ad837a"
         id="polygon60" />
      <polygon
         points="538.4,445.4 556.05,536.15 498.07,465.57 "
         style="fill:#9d7360"
         id="polygon62" />
      <polygon
         points="556.05,536.15 586.3,445.4 656.88,505.9 "
         style="fill:#c69470"
         id="polygon64" />
      <polygon
         points="608.99,417.68 630.83,362.22 669.49,405.07 "
         style="fill:#734737"
         id="polygon66" />
      <polygon
         points="567.11,327.77 583.78,387.43 562.35,387.43 540.93,387.43 "
         style="fill:#734737"
         id="polygon68" />
      <polygon
         points="726.62,252.99 644.28,334.49 690.49,188.29 "
         style="fill:#39414a"
         id="polygon70" />
      <polygon
         points="774.94,699.16 837.54,544.97 669.49,405.07 656.88,505.9 "
         style="fill:#000800"
         id="polygon72" />
      <polygon
         points="656.88,505.9 774.94,699.16 608.99,819.32 "
         style="fill:#182020"
         id="polygon74" />
      <circle
         cx="562.34998"
         cy="416.42001"
         r="28.99"
         style="fill:#4b3128"
         id="circle76" />
      <polygon
         points="252.3,505.9 300.19,819.32 361.95,824.78 332.96,768.06 315.32,710.08 315.32,657.15 "
         style="fill:#101010"
         id="polygon78" />
      <polygon
         points="444.67,553.8 454.7,465.57 411.11,465.57 "
         style="fill:#d9caba"
         id="polygon80" />
      <polygon
         points="218.69,188.29 159.03,215.18 107.77,252.99 138.86,234.5 182.56,252.99 "
         style="fill:#525a62"
         id="polygon82" />
      <polygon
         points="218.69,188.29 264.9,334.49 340.52,276.51 306.92,120.23 "
         style="fill:#525a62"
         id="polygon84" />
      <polygon
         points="182.56,252.99 103.57,432.8 71.64,544.97 239.69,405.07 264.9,334.49 "
         style="fill:#293131"
         id="polygon86" />
      <polygon
         points="454.7,108.58 395.98,95.02 306.92,120.23 340.52,276.51 454.47,297.94 454.7,297.94 568.65,276.51 602.26,120.23 513.2,95.02 "
         style="fill:#4a525a"
         id="polygon88" />
      <polygon
         points="411.11,465.57 454.7,465.57 395.98,415.15 370.77,445.4 "
         style="fill:#c69470"
         id="polygon90" />
      <polygon
         points="252.3,505.9 322.88,445.4 300.19,417.68 239.69,405.07 "
         style="fill:#b5837a"
         id="polygon92" />
      <polygon
         points="353.13,536.15 370.77,445.4 346.83,445.4 322.88,445.4 "
         style="fill:#ad837a"
         id="polygon94" />
      <polygon
         points="342.07,327.77 368.25,387.43 395.98,415.15 454.47,345.41 "
         style="fill:#84523f"
         id="polygon96" />
      <polygon
         points="300.19,417.68 325.4,387.43 342.07,327.77 278.35,362.22 "
         style="fill:#84523f"
         id="polygon98" />
      <polygon
         points="444.67,553.8 404.8,544.97 441.36,581.52 "
         style="fill:#4b3128"
         id="polygon100" />
      <path
         d="m 317.84,416.42 a 29,29 0 0 1 29,-29 H 325.4 l -25.21,30.25 22.69,27.73 h 23.95 a 29,29 0 0 1 -28.99,-28.98 z"
         style="fill:#100000"
         id="path102"
         inkscape:connector-curvature="0" />
      <path
         d="m 346.83,387.43 a 29,29 0 1 1 0,58 h 23.95 L 396,415.16 368.27,387.43 Z"
         style="fill:#100000"
         id="path104"
         inkscape:connector-curvature="0" />
      <polygon
         points="353.13,536.15 252.3,505.9 315.32,657.15 "
         style="fill:#182020"
         id="polygon106" />
      <polygon
         points="454.47,725.21 454.7,725.21 513.2,737.81 454.7,745.37 454.47,745.37 395.98,737.81 "
         style="fill:#734737"
         id="polygon108" />
      <polygon
         points="326.66,703.78 342.07,571.53 315.32,657.15 "
         style="fill:#ccbeaf"
         id="polygon110" />
      <polyline
         points="350.61 735.29 395.98 737.81 454.47 725.21 454.7 725.21 513.2 737.81 558.57 735.29 454.7 708.19 454.47 708.19"
         style="fill:#cea493"
         id="polyline112" />
      <polygon
         points="326.66,703.78 315.32,657.15 315.32,710.08 "
         style="fill:#ccbeaf"
         id="polygon114" />
      <polygon
         points="326.66,703.78 332.96,768.06 350.61,735.29 "
         style="fill:#eedecc"
         id="polygon116" />
      <polygon
         points="513.2,737.81 454.7,745.37 454.47,745.37 395.98,737.81 417.41,852.51 454.7,848.73 491.77,852.51 "
         style="fill:#eedecc"
         id="polygon118" />
      <polygon
         points="395.98,737.81 350.61,735.29 361.95,824.78 "
         style="fill:#eedecc"
         id="polygon120" />
      <polygon
         points="395.98,737.81 361.95,824.78 417.41,852.51 "
         style="fill:#cea493"
         id="polygon122" />
      <polygon
         points="454.47,708.19 342.07,571.53 350.61,735.29 "
         style="fill:#ccbeaf"
         id="polygon124" />
      <polygon
         points="342.07,571.53 326.66,703.78 350.61,735.29 "
         style="fill:#eedecc"
         id="polygon126" />
      <polygon
         points="326.66,703.78 315.32,710.08 332.96,768.06 "
         style="fill:#ccbeaf"
         id="polygon128" />
      <polygon
         points="350.61,735.29 332.96,768.06 361.95,824.78 "
         style="fill:#cea493"
         id="polygon130" />
      <polygon
         points="264.9,334.49 278.35,362.22 342.07,327.77 340.52,276.51 "
         style="fill:#ad837a"
         id="polygon132" />
      <polygon
         points="454.47,345.41 454.7,345.41 568.65,276.51 454.7,297.94 340.52,276.51 "
         style="fill:#eedecc"
         id="polygon134" />
      <polygon
         points="342.07,327.77 454.47,345.41 340.52,276.51 "
         style="fill:#cea493"
         id="polygon136" />
      <polygon
         points="278.35,362.22 264.9,334.49 239.69,405.07 "
         style="fill:#cea493"
         id="polygon138" />
      <polygon
         points="454.47,581.52 441.36,581.52 404.8,544.97 444.67,553.8 411.11,465.57 353.13,536.15 342.07,571.53 454.47,708.19 454.7,708.19 567.11,571.53 556.05,536.15 498.07,465.57 464.51,553.8 504.38,544.97 467.82,581.52 454.7,581.52 "
         style="fill:#eedecc"
         id="polygon140" />
      <polygon
         points=""
         style="fill:#ff0000"
         id="polygon142" />
      <polygon
         points="90.97,297.52 85.93,376.5 103.57,432.8 182.56,252.99 138.86,234.5 107.77,252.99 "
         style="fill:#ad837a"
         id="polygon144" />
      <polygon
         points="395.98,415.15 454.7,465.57 513.2,415.15 454.7,345.41 454.47,345.41 "
         style="fill:#734737"
         id="polygon146" />
      <polygon
         points="370.77,445.4 353.13,536.15 411.11,465.57 "
         style="fill:#9d7360"
         id="polygon148" />
      <polygon
         points="353.13,536.15 322.88,445.4 252.3,505.9 "
         style="fill:#c69470"
         id="polygon150" />
      <polygon
         points="300.19,417.68 278.35,362.22 239.69,405.07 "
         style="fill:#734737"
         id="polygon152" />
      <polygon
         points="342.07,327.77 325.4,387.43 346.83,387.43 368.25,387.43 "
         style="fill:#734737"
         id="polygon154" />
      <polygon
         points="182.56,252.99 264.9,334.49 218.69,188.29 "
         style="fill:#39414a"
         id="polygon156" />
      <polygon
         points="134.24,699.16 71.64,544.97 239.69,405.07 252.3,505.9 "
         style="fill:#000800"
         id="polygon158" />
      <polygon
         points="252.3,505.9 134.24,699.16 300.19,819.32 "
         style="fill:#182020"
         id="polygon160" />
      <circle
         cx="346.82999"
         cy="416.42001"
         r="28.99"
         style="fill:#4b3128"
         id="circle162" />
    </g>
    <path
       inkscape:connector-curvature="0"
       id="path165"
       style="isolation:isolate;mix-blend-mode:overlay;fill:#bb003c"
       d="m 120,397.74 h 149.48 a 27.58,27.58 0 0 0 16.88,-5.76 l 68.78,-53.24 a 27.58,27.58 0 0 0 10.7,-21.81 V 271.14 A 27.58,27.58 0 0 0 338.26,243.56 H 120 a 27.58,27.58 0 0 0 -27.58,27.58 v 99 a 27.58,27.58 0 0 0 27.58,27.6 z" />
    <path
       inkscape:connector-curvature="0"
       id="path167"
       style="isolation:isolate;mix-blend-mode:overlay;fill:#56caff"
       d="m 413.58,338.73 68.78,53.25 a 27.58,27.58 0 0 0 16.88,5.77 h 149.48 a 27.58,27.58 0 0 0 27.58,-27.58 v -99 A 27.58,27.58 0 0 0 648.72,243.59 H 430.46 a 27.58,27.58 0 0 0 -27.58,27.58 v 45.78 a 27.58,27.58 0 0 0 10.7,21.78 z" />
    <path
       inkscape:connector-curvature="0"
       id="path169"
       style="isolation:isolate;mix-blend-mode:darken;fill:#bb003c"
       d="m 120,397.74 h 149.48 a 27.58,27.58 0 0 0 16.88,-5.76 l 68.78,-53.24 a 27.58,27.58 0 0 0 10.7,-21.81 V 271.14 A 27.58,27.58 0 0 0 338.26,243.56 H 120 a 27.58,27.58 0 0 0 -27.58,27.58 v 99 a 27.58,27.58 0 0 0 27.58,27.6 z" />
    <path
       inkscape:connector-curvature="0"
       id="path171"
       style="isolation:isolate;mix-blend-mode:darken;fill:#56caff"
       d="m 413.58,338.73 68.78,53.25 a 27.58,27.58 0 0 0 16.88,5.77 h 149.48 a 27.58,27.58 0 0 0 27.58,-27.58 v -99 A 27.58,27.58 0 0 0 648.72,243.59 H 430.46 a 27.58,27.58 0 0 0 -27.58,27.58 v 45.78 a 27.58,27.58 0 0 0 10.7,21.78 z" />
    <path
       inkscape:connector-curvature="0"
       id="path173"
       style="isolation:isolate;fill:#ffffff"
       d="M 648.72,202.2 H 430.46 a 68.66,68.66 0 0 0 -46.1,17.73 68.66,68.66 0 0 0 -46.1,-17.73 H 120 a 69,69 0 0 0 -68.94,68.94 v 99 A 69,69 0 0 0 120,439.08 h 149.48 a 69.29,69.29 0 0 0 42.2,-14.42 l 68.78,-53.24 c 1.35,-1 2.64,-2.16 3.9,-3.29 1.26,1.14 2.55,2.25 3.9,3.29 l 68.78,53.24 a 69.29,69.29 0 0 0 42.2,14.42 h 149.48 a 69,69 0 0 0 68.94,-68.94 v -99 A 69,69 0 0 0 648.72,202.2 Z M 365.84,316.92 a 27.58,27.58 0 0 1 -10.7,21.81 l -68.78,53.25 a 27.58,27.58 0 0 1 -16.88,5.77 H 120 A 27.58,27.58 0 0 1 92.42,370.17 v -99 A 27.58,27.58 0 0 1 120,243.59 h 218.26 a 27.58,27.58 0 0 1 27.58,27.58 z m 310.46,53.24 a 27.58,27.58 0 0 1 -27.58,27.58 H 499.24 a 27.58,27.58 0 0 1 -16.88,-5.76 l -68.78,-53.24 a 27.58,27.58 0 0 1 -10.7,-21.81 v -45.79 a 27.58,27.58 0 0 1 27.58,-27.58 h 218.26 a 27.58,27.58 0 0 1 27.58,27.58 z" />
  </g>
</svg>
