// Jest Snapshot v1, https://goo.gl/fbAQLP

exports[`br-item has the expected html structure 1`] = `
<div>
  <!-- ITEM LINK
      (ln 9 a 18): Atributos e classes são aplicadas de acordo com as propriedades escolhidas para o Item
      (ln 19) Caso a prop hover seja atribuída ao item, o atributo data-toggle="selection" será aplicado.
              Não funciona apenas para destacar o item com hover, mas para que o elemento seja acionado com clique
              obs: O exemplo de item com checkbox nos wbc não está funcionando corretamente. Comparar com exemplo no DS - 'Itens de seleção'
     -->
  
  <!-- ITEM !== LINK
    obs: Existem links também do tipo botão, de acordo com exemplo no DS
    (ln 41 a 44): Atributos e classes são aplicadas de acordo com as propriedades escolhidas para o Item
    (ln 39) A classe 'align-items-center' não faz parte do componente item no DS
    (ln 45 e 46) Recebe a densidade do pai (List ou qq outro) e aplica as classes 'py-3' para medium e 'py-4' para small
    (ln 48 a 51) Recebe 'data-toggle' (boolean) do List e aplica atributos ao Item (data-toggle e role)
    (ln 52) No clique do item, a classe open é aplicada ou retirada, bem como o ícone seta para cima e para baixo (ln 59 a 64)
  -->
  <div
    class="br-item align-items-center py-4"
  >
    <!-- (ln 55 a 74) Ajuste do conteúdo do Item de acordo com a prop 'data-toggle' do List
         (ln 60) Ajuste do título do conteúdo para que seja possível inserir outros elementos diferentes da prop 'title'
                 no componente cookiebar. Sem o ajuste a inclusão de outros elementos no slot default resultaria em conteúdo e não header/título do item
    -->
    <!--v-if-->
    <span>
      
      
    </span>
  </div>
  
  <span
    style="display: none;"
  >
    
    
  </span>
</div>
`;

exports[`br-item insert item into list 1`] = `
<div
  class="br-list"
  data-toggle="true"
  data-unique="true"
  density="large"
  role="list"
>
  <!--v-if-->
  <!--v-if-->
  
  <div>
    <!-- ITEM LINK
      (ln 9 a 18): Atributos e classes são aplicadas de acordo com as propriedades escolhidas para o Item
      (ln 19) Caso a prop hover seja atribuída ao item, o atributo data-toggle="selection" será aplicado.
              Não funciona apenas para destacar o item com hover, mas para que o elemento seja acionado com clique
              obs: O exemplo de item com checkbox nos wbc não está funcionando corretamente. Comparar com exemplo no DS - 'Itens de seleção'
     -->
    
    <!-- ITEM !== LINK
    obs: Existem links também do tipo botão, de acordo com exemplo no DS
    (ln 41 a 44): Atributos e classes são aplicadas de acordo com as propriedades escolhidas para o Item
    (ln 39) A classe 'align-items-center' não faz parte do componente item no DS
    (ln 45 e 46) Recebe a densidade do pai (List ou qq outro) e aplica as classes 'py-3' para medium e 'py-4' para small
    (ln 48 a 51) Recebe 'data-toggle' (boolean) do List e aplica atributos ao Item (data-toggle e role)
    (ln 52) No clique do item, a classe open é aplicada ou retirada, bem como o ícone seta para cima e para baixo (ln 59 a 64)
  -->
    <div
      class="br-item align-items-center"
      role="listitem"
    >
      <!-- (ln 55 a 74) Ajuste do conteúdo do Item de acordo com a prop 'data-toggle' do List
         (ln 60) Ajuste do título do conteúdo para que seja possível inserir outros elementos diferentes da prop 'title'
                 no componente cookiebar. Sem o ajuste a inclusão de outros elementos no slot default resultaria em conteúdo e não header/título do item
    -->
      <div
        class="content"
      >
        <div
          class="flex-fill"
        >
          Item 1 
          
          
        </div>
        <br-button-stub
          active="false"
          block="false"
          circle="true"
          class="ml-1"
          data-toggle="collapse"
          density="small"
          disabled="false"
          icon="chevron-down"
          inverted="false"
          loading="false"
          type="tertiary"
        />
      </div>
      <!--v-if-->
    </div>
    
    <span
      style="display: none;"
    >
      
      <div
        class="br-list"
        data-toggle="false"
        data-unique="false"
        density="large"
        role="list"
      >
        <!--v-if-->
        <!--v-if-->
        
        <div>
          <!-- ITEM LINK
      (ln 9 a 18): Atributos e classes são aplicadas de acordo com as propriedades escolhidas para o Item
      (ln 19) Caso a prop hover seja atribuída ao item, o atributo data-toggle="selection" será aplicado.
              Não funciona apenas para destacar o item com hover, mas para que o elemento seja acionado com clique
              obs: O exemplo de item com checkbox nos wbc não está funcionando corretamente. Comparar com exemplo no DS - 'Itens de seleção'
     -->
          
          <!-- ITEM !== LINK
    obs: Existem links também do tipo botão, de acordo com exemplo no DS
    (ln 41 a 44): Atributos e classes são aplicadas de acordo com as propriedades escolhidas para o Item
    (ln 39) A classe 'align-items-center' não faz parte do componente item no DS
    (ln 45 e 46) Recebe a densidade do pai (List ou qq outro) e aplica as classes 'py-3' para medium e 'py-4' para small
    (ln 48 a 51) Recebe 'data-toggle' (boolean) do List e aplica atributos ao Item (data-toggle e role)
    (ln 52) No clique do item, a classe open é aplicada ou retirada, bem como o ícone seta para cima e para baixo (ln 59 a 64)
  -->
          <div
            class="br-item align-items-center"
          >
            <!-- (ln 55 a 74) Ajuste do conteúdo do Item de acordo com a prop 'data-toggle' do List
         (ln 60) Ajuste do título do conteúdo para que seja possível inserir outros elementos diferentes da prop 'title'
                 no componente cookiebar. Sem o ajuste a inclusão de outros elementos no slot default resultaria em conteúdo e não header/título do item
    -->
            <!--v-if-->
            <span>
              
              Subitem 1.1
              
            </span>
          </div>
          
          <span
            style="display: none;"
          >
            
            Subitem 1.1
            
          </span>
        </div>
        <div>
          <!-- ITEM LINK
      (ln 9 a 18): Atributos e classes são aplicadas de acordo com as propriedades escolhidas para o Item
      (ln 19) Caso a prop hover seja atribuída ao item, o atributo data-toggle="selection" será aplicado.
              Não funciona apenas para destacar o item com hover, mas para que o elemento seja acionado com clique
              obs: O exemplo de item com checkbox nos wbc não está funcionando corretamente. Comparar com exemplo no DS - 'Itens de seleção'
     -->
          
          <!-- ITEM !== LINK
    obs: Existem links também do tipo botão, de acordo com exemplo no DS
    (ln 41 a 44): Atributos e classes são aplicadas de acordo com as propriedades escolhidas para o Item
    (ln 39) A classe 'align-items-center' não faz parte do componente item no DS
    (ln 45 e 46) Recebe a densidade do pai (List ou qq outro) e aplica as classes 'py-3' para medium e 'py-4' para small
    (ln 48 a 51) Recebe 'data-toggle' (boolean) do List e aplica atributos ao Item (data-toggle e role)
    (ln 52) No clique do item, a classe open é aplicada ou retirada, bem como o ícone seta para cima e para baixo (ln 59 a 64)
  -->
          <div
            class="br-item align-items-center"
          >
            <!-- (ln 55 a 74) Ajuste do conteúdo do Item de acordo com a prop 'data-toggle' do List
         (ln 60) Ajuste do título do conteúdo para que seja possível inserir outros elementos diferentes da prop 'title'
                 no componente cookiebar. Sem o ajuste a inclusão de outros elementos no slot default resultaria em conteúdo e não header/título do item
    -->
            <!--v-if-->
            <span>
              
              Subitem 1.2
              
            </span>
          </div>
          
          <span
            style="display: none;"
          >
            
            Subitem 1.2
            
          </span>
        </div>
        <div>
          <!-- ITEM LINK
      (ln 9 a 18): Atributos e classes são aplicadas de acordo com as propriedades escolhidas para o Item
      (ln 19) Caso a prop hover seja atribuída ao item, o atributo data-toggle="selection" será aplicado.
              Não funciona apenas para destacar o item com hover, mas para que o elemento seja acionado com clique
              obs: O exemplo de item com checkbox nos wbc não está funcionando corretamente. Comparar com exemplo no DS - 'Itens de seleção'
     -->
          
          <!-- ITEM !== LINK
    obs: Existem links também do tipo botão, de acordo com exemplo no DS
    (ln 41 a 44): Atributos e classes são aplicadas de acordo com as propriedades escolhidas para o Item
    (ln 39) A classe 'align-items-center' não faz parte do componente item no DS
    (ln 45 e 46) Recebe a densidade do pai (List ou qq outro) e aplica as classes 'py-3' para medium e 'py-4' para small
    (ln 48 a 51) Recebe 'data-toggle' (boolean) do List e aplica atributos ao Item (data-toggle e role)
    (ln 52) No clique do item, a classe open é aplicada ou retirada, bem como o ícone seta para cima e para baixo (ln 59 a 64)
  -->
          <div
            class="br-item align-items-center"
          >
            <!-- (ln 55 a 74) Ajuste do conteúdo do Item de acordo com a prop 'data-toggle' do List
         (ln 60) Ajuste do título do conteúdo para que seja possível inserir outros elementos diferentes da prop 'title'
                 no componente cookiebar. Sem o ajuste a inclusão de outros elementos no slot default resultaria em conteúdo e não header/título do item
    -->
            <!--v-if-->
            <span>
              
              Subitem 1.3
              
            </span>
          </div>
          
          <span
            style="display: none;"
          >
            
            Subitem 1.3
            
          </span>
        </div>
        
      </div>
      
    </span>
  </div>
  <span
    class="br-divider"
  />
  <div>
    <!-- ITEM LINK
      (ln 9 a 18): Atributos e classes são aplicadas de acordo com as propriedades escolhidas para o Item
      (ln 19) Caso a prop hover seja atribuída ao item, o atributo data-toggle="selection" será aplicado.
              Não funciona apenas para destacar o item com hover, mas para que o elemento seja acionado com clique
              obs: O exemplo de item com checkbox nos wbc não está funcionando corretamente. Comparar com exemplo no DS - 'Itens de seleção'
     -->
    
    <!-- ITEM !== LINK
    obs: Existem links também do tipo botão, de acordo com exemplo no DS
    (ln 41 a 44): Atributos e classes são aplicadas de acordo com as propriedades escolhidas para o Item
    (ln 39) A classe 'align-items-center' não faz parte do componente item no DS
    (ln 45 e 46) Recebe a densidade do pai (List ou qq outro) e aplica as classes 'py-3' para medium e 'py-4' para small
    (ln 48 a 51) Recebe 'data-toggle' (boolean) do List e aplica atributos ao Item (data-toggle e role)
    (ln 52) No clique do item, a classe open é aplicada ou retirada, bem como o ícone seta para cima e para baixo (ln 59 a 64)
  -->
    <div
      class="br-item align-items-center"
      role="listitem"
    >
      <!-- (ln 55 a 74) Ajuste do conteúdo do Item de acordo com a prop 'data-toggle' do List
         (ln 60) Ajuste do título do conteúdo para que seja possível inserir outros elementos diferentes da prop 'title'
                 no componente cookiebar. Sem o ajuste a inclusão de outros elementos no slot default resultaria em conteúdo e não header/título do item
    -->
      <div
        class="content"
      >
        <div
          class="flex-fill"
        >
          Item 2 
          
          
        </div>
        <br-button-stub
          active="false"
          block="false"
          circle="true"
          class="ml-1"
          data-toggle="collapse"
          density="small"
          disabled="false"
          icon="chevron-down"
          inverted="false"
          loading="false"
          type="tertiary"
        />
      </div>
      <!--v-if-->
    </div>
    
    <span
      style="display: none;"
    >
      
      <div
        class="br-list"
        data-toggle="false"
        data-unique="false"
        density="large"
        role="list"
      >
        <!--v-if-->
        <!--v-if-->
        
        <div>
          <!-- ITEM LINK
      (ln 9 a 18): Atributos e classes são aplicadas de acordo com as propriedades escolhidas para o Item
      (ln 19) Caso a prop hover seja atribuída ao item, o atributo data-toggle="selection" será aplicado.
              Não funciona apenas para destacar o item com hover, mas para que o elemento seja acionado com clique
              obs: O exemplo de item com checkbox nos wbc não está funcionando corretamente. Comparar com exemplo no DS - 'Itens de seleção'
     -->
          
          <!-- ITEM !== LINK
    obs: Existem links também do tipo botão, de acordo com exemplo no DS
    (ln 41 a 44): Atributos e classes são aplicadas de acordo com as propriedades escolhidas para o Item
    (ln 39) A classe 'align-items-center' não faz parte do componente item no DS
    (ln 45 e 46) Recebe a densidade do pai (List ou qq outro) e aplica as classes 'py-3' para medium e 'py-4' para small
    (ln 48 a 51) Recebe 'data-toggle' (boolean) do List e aplica atributos ao Item (data-toggle e role)
    (ln 52) No clique do item, a classe open é aplicada ou retirada, bem como o ícone seta para cima e para baixo (ln 59 a 64)
  -->
          <div
            class="br-item align-items-center"
          >
            <!-- (ln 55 a 74) Ajuste do conteúdo do Item de acordo com a prop 'data-toggle' do List
         (ln 60) Ajuste do título do conteúdo para que seja possível inserir outros elementos diferentes da prop 'title'
                 no componente cookiebar. Sem o ajuste a inclusão de outros elementos no slot default resultaria em conteúdo e não header/título do item
    -->
            <!--v-if-->
            <span>
              
              Detalhes do item 2
              
            </span>
          </div>
          
          <span
            style="display: none;"
          >
            
            Detalhes do item 2
            
          </span>
        </div>
        
      </div>
      
    </span>
  </div>
  
</div>
`;
