{
  "compilerOptions": {
    "target": "es2015",
    "module": "es2015",
    "baseUrl": ".",
    "moduleResolution": "node",
    // "paths": {
    //   "@components": [
    //     "src/library/components"
    //   ],
    //   "@dependencies": [
    //     "node_modules"
    //   ],
    //   "@ds": [
    //     "node_modules/@govbr-ds/core"
    //   ],
    //   "@mixins": [
    //     "src/library/mixins"
    //   ],
    //   "@utils": [
    //     "src/util"
    //   ],
    // },
    "lib": [
      "esnext",
      "dom",
      "dom.iterable",
      "scripthost"
    ]
  }
}
// TODO: COnfigurar esse arquivo corretamente
