@startuml
skinparam shadowing false
skinparam StateBackgroundColor none
skinparam StateBorderColor black
skinparam ArrowColor black
hide empty description
skinparam monochrome false
skinparam Ranksep 100
skinparam Nodesep 40
skinparam backgroundColor transparent
skinparam classbackgroundColor #cce1fc
skinparam classborderColor #000000
abstract class IReactive
abstract class IButtonObserver
abstract class IKeyPadObserver

Factory ..> XF 
XF --> Event
XF --|> IReactive
Factory..>Model
Factory..>KeyPad
Factory .right.> Button
Factory ..> Validation
Factory ..> ButtonController
Factory ..> Fona
Factory ..> LED
Factory ..> Uart
Button --|> IReactive
Button --|> IKeyPadObserver
ButtonController --|> IButtonObserver
Validation --|> IReactive
KeyPad --|> IReactive
Button ..> IButtonObserver
KeyPad ..> IKeyPadObserver
KeyPad ..> GPO
ButtonController-->Model
Validation..>Model
Validation -->LED
LED..>GPO
Fona-->Uart

ButtonController --|> IFonaObserver
ButtonController --|> IValidationObserver
Fona --|> IUARTObserver
Uart ..> IUARTObserver
Validation ..> IValidationObserver
Fona ..> IFonaObserver


GPO-|>GPIO


@enduml