<svg width="10" height="10" xmlns="http://www.w3.org/2000/svg" viewBox="0 0 10 10" preserveAspectRatio="none">
      <defs>
        <style type="text/css">
          #holder text {
            fill: #ffffff;
            font-family: sans-serif;
            font-size: 6px;
            font-weight: 400;
          }
        </style>
      </defs>
      <g id="holder">
        <rect width="100%" height="100%" fill="#db39ad"></rect>
        <g>
          <text text-anchor="middle" x="50%" y="50%" dy=".3em">E</text>
        </g>
      </g>
    </svg>