%YAML 1.1
%TAG !u! tag:unity3d.com,2011:
--- !u!1 &5310518511069571590
GameObject:
  m_ObjectHideFlags: 0
  m_CorrespondingSourceObject: {fileID: 0}
  m_PrefabInstance: {fileID: 0}
  m_PrefabAsset: {fileID: 0}
  serializedVersion: 6
  m_Component:
  - component: {fileID: 5310518511069571588}
  - component: {fileID: 5310518511069571591}
  m_Layer: 0
  m_Name: Grass07LOD
  m_TagString: Untagged
  m_Icon: {fileID: 0}
  m_NavMeshLayer: 0
  m_StaticEditorFlags: 0
  m_IsActive: 1
--- !u!4 &5310518511069571588
Transform:
  m_ObjectHideFlags: 0
  m_CorrespondingSourceObject: {fileID: 0}
  m_PrefabInstance: {fileID: 0}
  m_PrefabAsset: {fileID: 0}
  m_GameObject: {fileID: 5310518511069571590}
  m_LocalRotation: {x: 0, y: 0, z: 0, w: 1}
  m_LocalPosition: {x: 0, y: 0, z: 0}
  m_LocalScale: {x: 1, y: 1, z: 1}
  m_Children:
  - {fileID: 5310518512157601036}
  m_Father: {fileID: 0}
  m_RootOrder: 0
  m_LocalEulerAnglesHint: {x: 0, y: 0, z: 0}
--- !u!205 &5310518511069571591
LODGroup:
  m_ObjectHideFlags: 0
  m_CorrespondingSourceObject: {fileID: 0}
  m_PrefabInstance: {fileID: 0}
  m_PrefabAsset: {fileID: 0}
  m_GameObject: {fileID: 5310518511069571590}
  serializedVersion: 2
  m_LocalReferencePoint: {x: -0.15167159, y: 0.2029393, z: 0.10725534}
  m_Size: 1.2293632
  m_FadeMode: 0
  m_AnimateCrossFading: 0
  m_LastLODIsBillboard: 0
  m_LODs:
  - screenRelativeHeight: 0.014175383
    fadeTransitionWidth: 0
    renderers:
    - renderer: {fileID: 5310518512159977748}
  - screenRelativeHeight: 0.0015729888
    fadeTransitionWidth: 0
    renderers: []
  - screenRelativeHeight: 0.00014355045
    fadeTransitionWidth: 0
    renderers: []
  m_Enabled: 1
--- !u!1001 &5310518512157830072
PrefabInstance:
  m_ObjectHideFlags: 0
  serializedVersion: 2
  m_Modification:
    m_TransformParent: {fileID: 5310518511069571588}
    m_Modifications:
    - target: {fileID: 173864, guid: 55be384447729584fb1682d6f37d13c9, type: 3}
      propertyPath: m_Name
      value: Grass3D_a_07
      objectReference: {fileID: 0}
    - target: {fileID: 493236, guid: 55be384447729584fb1682d6f37d13c9, type: 3}
      propertyPath: m_LocalPosition.x
      value: 0
      objectReference: {fileID: 0}
    - target: {fileID: 493236, guid: 55be384447729584fb1682d6f37d13c9, type: 3}
      propertyPath: m_LocalPosition.y
      value: 0
      objectReference: {fileID: 0}
    - target: {fileID: 493236, guid: 55be384447729584fb1682d6f37d13c9, type: 3}
      propertyPath: m_LocalPosition.z
      value: 0
      objectReference: {fileID: 0}
    - target: {fileID: 493236, guid: 55be384447729584fb1682d6f37d13c9, type: 3}
      propertyPath: m_LocalRotation.x
      value: 0
      objectReference: {fileID: 0}
    - target: {fileID: 493236, guid: 55be384447729584fb1682d6f37d13c9, type: 3}
      propertyPath: m_LocalRotation.y
      value: 0
      objectReference: {fileID: 0}
    - target: {fileID: 493236, guid: 55be384447729584fb1682d6f37d13c9, type: 3}
      propertyPath: m_LocalRotation.z
      value: 0
      objectReference: {fileID: 0}
    - target: {fileID: 493236, guid: 55be384447729584fb1682d6f37d13c9, type: 3}
      propertyPath: m_LocalRotation.w
      value: 1
      objectReference: {fileID: 0}
    - target: {fileID: 493236, guid: 55be384447729584fb1682d6f37d13c9, type: 3}
      propertyPath: m_RootOrder
      value: 0
      objectReference: {fileID: 0}
    - target: {fileID: 493236, guid: 55be384447729584fb1682d6f37d13c9, type: 3}
      propertyPath: m_LocalEulerAnglesHint.x
      value: 0
      objectReference: {fileID: 0}
    - target: {fileID: 493236, guid: 55be384447729584fb1682d6f37d13c9, type: 3}
      propertyPath: m_LocalEulerAnglesHint.y
      value: 0
      objectReference: {fileID: 0}
    - target: {fileID: 493236, guid: 55be384447729584fb1682d6f37d13c9, type: 3}
      propertyPath: m_LocalEulerAnglesHint.z
      value: 0
      objectReference: {fileID: 0}
    m_RemovedComponents: []
  m_SourcePrefab: {fileID: 100100000, guid: 55be384447729584fb1682d6f37d13c9, type: 3}
--- !u!4 &5310518512157601036 stripped
Transform:
  m_CorrespondingSourceObject: {fileID: 493236, guid: 55be384447729584fb1682d6f37d13c9,
    type: 3}
  m_PrefabInstance: {fileID: 5310518512157830072}
  m_PrefabAsset: {fileID: 0}
--- !u!23 &5310518512159977748 stripped
MeshRenderer:
  m_CorrespondingSourceObject: {fileID: 2349740, guid: 55be384447729584fb1682d6f37d13c9,
    type: 3}
  m_PrefabInstance: {fileID: 5310518512157830072}
  m_PrefabAsset: {fileID: 0}
