%YAML 1.1
%TAG !u! tag:unity3d.com,2011:
--- !u!114 &11400000
MonoBehaviour:
  m_ObjectHideFlags: 0
  m_CorrespondingSourceObject: {fileID: 0}
  m_PrefabInstance: {fileID: 0}
  m_PrefabAsset: {fileID: 0}
  m_GameObject: {fileID: 0}
  m_Enabled: 1
  m_EditorHideFlags: 0
  m_Script: {fileID: 11500000, guid: 57dfce3561fb3fd4fbd958b134de5cc6, type: 3}
  m_Name: AppleTree01
  m_EditorClassIdentifier: 
  elevationSurvivalTypes: 0300000004000000
  elevationSurvivalRates:
  - 1
  - 1
  climateSurvivalTypes: 02000000
  climateSurvivalRates:
  - 0.5
  variations:
  - subTypes:
    - subPrefab: {fileID: 130378, guid: 03c3278bd8d30bd4fa8bb03391650656, type: 3}
      subType: 1
  - subTypes:
    - subPrefab: {fileID: 110464, guid: c7cfa27896bc19440b87adef52ac810f, type: 3}
      subType: 1
  - subTypes:
    - subPrefab: {fileID: 115186, guid: 726b35f9f5e1ebc428de41be7e9fc15f, type: 3}
      subType: 1
  - subTypes:
    - subPrefab: {fileID: 159674, guid: 0bc3790b686ff2a4b86932f84bff477b, type: 3}
      subType: 1
  type: 1
  seed: 0
  density: 1
