{
    "name": "07_Tests",
    "references": [
        "GUID:21d9d2ec9c1de504d9b1d9e18b1cc92a",
        "GUID:8a43408f3e9c963449ac5b36c1b54130"
    ],
    "optionalUnityReferences": [
        "TestAssemblies"
    ],
    "includePlatforms": [
        "Editor"
    ],
    "excludePlatforms": [],
    "allowUnsafeCode": false,
    "overrideReferences": false,
    "precompiledReferences": [],
    "autoReferenced": true,
    "defineConstraints": [],
    "versionDefines": []
}