%YAML 1.1
%TAG !u! tag:unity3d.com,2011:
--- !u!21 &2100000
Material:
  serializedVersion: 6
  m_ObjectHideFlags: 0
  m_CorrespondingSourceObject: {fileID: 0}
  m_PrefabInstance: {fileID: 0}
  m_PrefabAsset: {fileID: 0}
  m_Name: LPWDefault
  m_Shader: {fileID: 4800000, guid: 8165be4dd0b12774d80426d906df9c38, type: 3}
  m_ShaderKeywords: LPW_HQFOAM LPW_SHADOWS WATER_REFRACTIVE _CULL_ON _CUSTOM_SHAPE
    _DISTORT_ON _EDGEBLEND_ON _HQFOAM_ON _LIGHTABS_ON _POINTLIGHTS_ON _SHADING_VERTEXLIT
    _WAVES_HIGHQUALITY
  m_LightmapFlags: 1
  m_EnableInstancingVariants: 0
  m_DoubleSidedGI: 0
  m_CustomRenderQueue: 2500
  stringTagMap: {}
  disabledShaderPasses: []
  m_SavedProperties:
    serializedVersion: 3
    m_TexEnvs:
    - _BumpTex:
        m_Texture: {fileID: 2800000, guid: 5172883f19560c34db24c164f824d406, type: 3}
        m_Scale: {x: 1, y: 1}
        m_Offset: {x: 0, y: 0}
    - _FresnelTex:
        m_Texture: {fileID: 2800000, guid: bbe71c065be7eca47b24d1e03bf041b3, type: 3}
        m_Scale: {x: 1, y: 1}
        m_Offset: {x: 0, y: 0}
    - _NoiseTex:
        m_Texture: {fileID: 2800000, guid: 6a1c221a7d11eaa4e875ae74a888d906, type: 3}
        m_Scale: {x: 1, y: 1}
        m_Offset: {x: 0, y: 0}
    - _ReflectionTex:
        m_Texture: {fileID: 0}
        m_Scale: {x: 1, y: 1}
        m_Offset: {x: 0, y: 0}
    - _RefractionTex:
        m_Texture: {fileID: 0}
        m_Scale: {x: 1, y: 1}
        m_Offset: {x: 0, y: 0}
    m_Floats:
    - _Absorption: 50
    - _BumpScale: 35
    - _BumpScale_: 35
    - _BumpSpeed: 0.2
    - _Cull: 1
    - _Cull_: 0
    - _Diffuse: 0.62
    - _Direction: 165
    - _Distort: 1
    - _Distortion: 1
    - _EdgeBlend: 1
    - _EnableShadows: 1
    - _FoamScale: 10
    - _FoamSpeed: 0.3
    - _FoamSpread: 1
    - _FresPower: 1.141
    - _HQFoam: 1
    - _Height: 0.5
    - _Height_: 0.5
    - _Length: 20
    - _LightAbs: 1
    - _NormalOffset: 1.93
    - _Opacity: 0.243
    - _PointLights: 1
    - _RHeight: 0.25
    - _RHeight_: 0.25
    - _RSpeed: 1
    - _RSpeed_: 1
    - _Reflection: 1.127
    - _Refraction: 2
    - _Scale: 1
    - _Scale_: 1
    - _Shading: 1
    - _Shadow: 0.72
    - _ShoreDistance: 2
    - _ShoreIntensity: 1
    - _Specular: 70
    - _Speed: 0.5
    - _Speed_: 0.5
    - _Steepness: 0.5
    - _Stretch: 30
    - _TexSize_: 64
    - _Time_: 0
    - _TransformScale_: 1
    - _Waves: 2
    - _ZWrite: 1
    m_Colors:
    - _Color: {r: 0, g: 0.5, b: 0.7, a: 1}
    - _DeepColor: {r: 0, g: 0.0074172295, b: 0.254717, a: 1}
    - _Direction_: {r: -0.9659258, g: 0.25881913, b: -9.659258, a: 2.5881913}
    - _FresColor: {r: 0.305, g: 0.371, b: 0.395, a: 1}
    - _ShoreColor: {r: 1, g: 1, b: 1, a: 1}
    - _SpecColor: {r: 0.703, g: 0.676, b: 0.438, a: 1}
    - _Sun: {r: 0.24999997, g: 0.86602545, b: -0.43301266, a: 0}
    - _SunColor: {r: 1, g: 0.93436444, b: 0.6462264, a: 1}
