%YAML 1.1
%TAG !u! tag:unity3d.com,2011:
--- !u!1 &8269744308608025353
GameObject:
  m_ObjectHideFlags: 0
  m_CorrespondingSourceObject: {fileID: 0}
  m_PrefabInstance: {fileID: 0}
  m_PrefabAsset: {fileID: 0}
  serializedVersion: 6
  m_Component:
  - component: {fileID: 8269744308608025355}
  - component: {fileID: 8269744308608025354}
  m_Layer: 0
  m_Name: GrassDry07LOD
  m_TagString: Untagged
  m_Icon: {fileID: 0}
  m_NavMeshLayer: 0
  m_StaticEditorFlags: 0
  m_IsActive: 1
--- !u!4 &8269744308608025355
Transform:
  m_ObjectHideFlags: 0
  m_CorrespondingSourceObject: {fileID: 0}
  m_PrefabInstance: {fileID: 0}
  m_PrefabAsset: {fileID: 0}
  m_GameObject: {fileID: 8269744308608025353}
  m_LocalRotation: {x: 0, y: 0, z: 0, w: 1}
  m_LocalPosition: {x: 0, y: 0, z: 0}
  m_LocalScale: {x: 1, y: 1, z: 1}
  m_Children:
  - {fileID: 8269744308782875907}
  m_Father: {fileID: 0}
  m_RootOrder: 0
  m_LocalEulerAnglesHint: {x: 0, y: 0, z: 0}
--- !u!205 &8269744308608025354
LODGroup:
  m_ObjectHideFlags: 0
  m_CorrespondingSourceObject: {fileID: 0}
  m_PrefabInstance: {fileID: 0}
  m_PrefabAsset: {fileID: 0}
  m_GameObject: {fileID: 8269744308608025353}
  serializedVersion: 2
  m_LocalReferencePoint: {x: 0.16605717, y: 0.2559133, z: 0.067754984}
  m_Size: 1.4413471
  m_FadeMode: 0
  m_AnimateCrossFading: 0
  m_LastLODIsBillboard: 0
  m_LODs:
  - screenRelativeHeight: 0.014175383
    fadeTransitionWidth: 0
    renderers:
    - renderer: {fileID: 8269744308784637255}
  - screenRelativeHeight: 0.0015729888
    fadeTransitionWidth: 0
    renderers: []
  - screenRelativeHeight: 0.00014355045
    fadeTransitionWidth: 0
    renderers: []
  m_Enabled: 1
--- !u!1001 &8269744308782442077
PrefabInstance:
  m_ObjectHideFlags: 0
  serializedVersion: 2
  m_Modification:
    m_TransformParent: {fileID: 8269744308608025355}
    m_Modifications:
    - target: {fileID: 116096, guid: f3295062a9369c042af114237c7d4b9e, type: 3}
      propertyPath: m_Name
      value: Grass3D_b_07
      objectReference: {fileID: 0}
    - target: {fileID: 451422, guid: f3295062a9369c042af114237c7d4b9e, type: 3}
      propertyPath: m_LocalPosition.x
      value: 0
      objectReference: {fileID: 0}
    - target: {fileID: 451422, guid: f3295062a9369c042af114237c7d4b9e, type: 3}
      propertyPath: m_LocalPosition.y
      value: 0
      objectReference: {fileID: 0}
    - target: {fileID: 451422, guid: f3295062a9369c042af114237c7d4b9e, type: 3}
      propertyPath: m_LocalPosition.z
      value: 0
      objectReference: {fileID: 0}
    - target: {fileID: 451422, guid: f3295062a9369c042af114237c7d4b9e, type: 3}
      propertyPath: m_LocalRotation.x
      value: 0
      objectReference: {fileID: 0}
    - target: {fileID: 451422, guid: f3295062a9369c042af114237c7d4b9e, type: 3}
      propertyPath: m_LocalRotation.y
      value: 0
      objectReference: {fileID: 0}
    - target: {fileID: 451422, guid: f3295062a9369c042af114237c7d4b9e, type: 3}
      propertyPath: m_LocalRotation.z
      value: 0
      objectReference: {fileID: 0}
    - target: {fileID: 451422, guid: f3295062a9369c042af114237c7d4b9e, type: 3}
      propertyPath: m_LocalRotation.w
      value: 1
      objectReference: {fileID: 0}
    - target: {fileID: 451422, guid: f3295062a9369c042af114237c7d4b9e, type: 3}
      propertyPath: m_RootOrder
      value: 0
      objectReference: {fileID: 0}
    - target: {fileID: 451422, guid: f3295062a9369c042af114237c7d4b9e, type: 3}
      propertyPath: m_LocalEulerAnglesHint.x
      value: 0
      objectReference: {fileID: 0}
    - target: {fileID: 451422, guid: f3295062a9369c042af114237c7d4b9e, type: 3}
      propertyPath: m_LocalEulerAnglesHint.y
      value: 0
      objectReference: {fileID: 0}
    - target: {fileID: 451422, guid: f3295062a9369c042af114237c7d4b9e, type: 3}
      propertyPath: m_LocalEulerAnglesHint.z
      value: 0
      objectReference: {fileID: 0}
    m_RemovedComponents: []
  m_SourcePrefab: {fileID: 100100000, guid: f3295062a9369c042af114237c7d4b9e, type: 3}
--- !u!4 &8269744308782875907 stripped
Transform:
  m_CorrespondingSourceObject: {fileID: 451422, guid: f3295062a9369c042af114237c7d4b9e,
    type: 3}
  m_PrefabInstance: {fileID: 8269744308782442077}
  m_PrefabAsset: {fileID: 0}
--- !u!23 &8269744308784637255 stripped
MeshRenderer:
  m_CorrespondingSourceObject: {fileID: 2327322, guid: f3295062a9369c042af114237c7d4b9e,
    type: 3}
  m_PrefabInstance: {fileID: 8269744308782442077}
  m_PrefabAsset: {fileID: 0}
