%YAML 1.1
%TAG !u! tag:unity3d.com,2011:
--- !u!114 &11400000
MonoBehaviour:
  m_ObjectHideFlags: 0
  m_CorrespondingSourceObject: {fileID: 0}
  m_PrefabInstance: {fileID: 0}
  m_PrefabAsset: {fileID: 0}
  m_GameObject: {fileID: 0}
  m_Enabled: 1
  m_EditorHideFlags: 0
  m_Script: {fileID: 11500000, guid: c70436bb1eaa8234dbe913514fe825a5, type: 3}
  m_Name: StrongAveragingNoiseGenerator
  m_EditorClassIdentifier: 
  octaves: 10
  lacunarity: 1
  persistance: 0.99
  frequencyModifier: 0.005
  amplitudeModifier: 50
  horizontalMod: 0
  seaAnim:
    serializedVersion: 2
    m_Curve:
    - serializedVersion: 3
      time: 0
      value: -0.063690186
      inSlope: -0.024897184
      outSlope: -0.024897184
      tangentMode: 34
      weightedMode: 0
      inWeight: 0
      outWeight: 0.33333334
    - serializedVersion: 3
      time: 0.33514616
      value: -0.07203438
      inSlope: 0.0096784085
      outSlope: 0.0096784085
      tangentMode: 34
      weightedMode: 0
      inWeight: 0.33333334
      outWeight: 0.33333334
    - serializedVersion: 3
      time: 0.7590554
      value: -0.053274702
      inSlope: 0.00051314756
      outSlope: 0.00051314756
      tangentMode: 34
      weightedMode: 0
      inWeight: 0.33333334
      outWeight: 0.33333334
    - serializedVersion: 3
      time: 1
      value: -0.063690186
      inSlope: -0.043227706
      outSlope: -0.043227706
      tangentMode: 34
      weightedMode: 0
      inWeight: 0.33333334
      outWeight: 0
    m_PreInfinity: 2
    m_PostInfinity: 2
    m_RotationOrder: 4
  coastAnim:
    serializedVersion: 2
    m_Curve:
    - serializedVersion: 3
      time: 0
      value: 0.034439087
      inSlope: 0
      outSlope: 0
      tangentMode: 34
      weightedMode: 0
      inWeight: 0
      outWeight: 0.33333334
    - serializedVersion: 3
      time: 0.08381717
      value: 0.034439087
      inSlope: -0.73734605
      outSlope: -0.73734605
      tangentMode: 0
      weightedMode: 0
      inWeight: 0.33333334
      outWeight: 0.020995287
    - serializedVersion: 3
      time: 0.28013888
      value: 0.05303061
      inSlope: -0.014105428
      outSlope: -0.014105428
      tangentMode: 0
      weightedMode: 0
      inWeight: 0.33333334
      outWeight: 0.13552886
    - serializedVersion: 3
      time: 0.44524333
      value: 0.047007613
      inSlope: 0.05259256
      outSlope: 0.05259256
      tangentMode: 0
      weightedMode: 0
      inWeight: 0.33333334
      outWeight: 0.09538367
    - serializedVersion: 3
      time: 0.7164087
      value: 0.050459646
      inSlope: -0.20842713
      outSlope: -0.20842713
      tangentMode: 0
      weightedMode: 0
      inWeight: 0.33333334
      outWeight: 0.12024745
    - serializedVersion: 3
      time: 1
      value: 0.034439087
      inSlope: -0.05649172
      outSlope: -0.05649172
      tangentMode: 34
      weightedMode: 0
      inWeight: 0.33333334
      outWeight: 0
    m_PreInfinity: 2
    m_PostInfinity: 2
    m_RotationOrder: 4
  lowlandAnim:
    serializedVersion: 2
    m_Curve:
    - serializedVersion: 3
      time: 0
      value: 0.13404846
      inSlope: 0
      outSlope: 0
      tangentMode: 34
      weightedMode: 0
      inWeight: 0
      outWeight: 0.33333334
    - serializedVersion: 3
      time: 0.08381717
      value: 0.13404846
      inSlope: -0.116162814
      outSlope: -0.116162814
      tangentMode: 0
      weightedMode: 0
      inWeight: 0.33333334
      outWeight: 0.17224759
    - serializedVersion: 3
      time: 0.29577452
      value: 0.13892993
      inSlope: -0.031012861
      outSlope: -0.031012861
      tangentMode: 0
      weightedMode: 0
      inWeight: 0.33333334
      outWeight: 0.14041759
    - serializedVersion: 3
      time: 0.474496
      value: 0.1399475
      inSlope: -0.039740216
      outSlope: -0.039740216
      tangentMode: 0
      weightedMode: 0
      inWeight: 0.33333334
      outWeight: 0.14541702
    - serializedVersion: 3
      time: 0.7156763
      value: 0.15040472
      inSlope: -0.06902233
      outSlope: -0.06902233
      tangentMode: 0
      weightedMode: 0
      inWeight: 0.33333334
      outWeight: 0.19185184
    - serializedVersion: 3
      time: 1
      value: 0.13404846
      inSlope: -0.057526898
      outSlope: -0.057526898
      tangentMode: 34
      weightedMode: 0
      inWeight: 0.33333334
      outWeight: 0
    m_PreInfinity: 2
    m_PostInfinity: 2
    m_RotationOrder: 4
  midlandAnim:
    serializedVersion: 2
    m_Curve:
    - serializedVersion: 3
      time: 0
      value: 0.39949036
      inSlope: 0
      outSlope: 0
      tangentMode: 34
      weightedMode: 0
      inWeight: 0
      outWeight: 0.33333334
    - serializedVersion: 3
      time: 0.08381717
      value: 0.39949036
      inSlope: -0.2010669
      outSlope: -0.2010669
      tangentMode: 0
      weightedMode: 0
      inWeight: 0.33333334
      outWeight: 0.16277312
    - serializedVersion: 3
      time: 0.27470043
      value: 0.40570942
      inSlope: 0.036740124
      outSlope: 0.036740124
      tangentMode: 0
      weightedMode: 0
      inWeight: 0.33333334
      outWeight: 0.15928636
    - serializedVersion: 3
      time: 0.43436638
      value: 0.39533934
      inSlope: 0.059287682
      outSlope: 0.059287682
      tangentMode: 0
      weightedMode: 0
      inWeight: 0.33333334
      outWeight: 0.10015811
    - serializedVersion: 3
      time: 0.7156763
      value: 0.4123264
      inSlope: -0.05103693
      outSlope: -0.05103693
      tangentMode: 0
      weightedMode: 0
      inWeight: 0.33333334
      outWeight: 0.21337062
    - serializedVersion: 3
      time: 1
      value: 0.39949036
      inSlope: -0.045145866
      outSlope: -0.045145866
      tangentMode: 34
      weightedMode: 0
      inWeight: 0.33333334
      outWeight: 0
    m_PreInfinity: 2
    m_PostInfinity: 2
    m_RotationOrder: 4
  highlandAnim:
    serializedVersion: 2
    m_Curve:
    - serializedVersion: 3
      time: 0
      value: 0.66908264
      inSlope: 0
      outSlope: 0
      tangentMode: 34
      weightedMode: 0
      inWeight: 0
      outWeight: 0.33333334
    - serializedVersion: 3
      time: 0.08381717
      value: 0.66908264
      inSlope: -0.73734605
      outSlope: -0.73734605
      tangentMode: 0
      weightedMode: 0
      inWeight: 0.33333334
      outWeight: 0.020995287
    - serializedVersion: 3
      time: 0.29577452
      value: 0.66125727
      inSlope: 0.33665088
      outSlope: 0.33665088
      tangentMode: 0
      weightedMode: 0
      inWeight: 0.33333334
      outWeight: 0.17505448
    - serializedVersion: 3
      time: 0.4445635
      value: 0.6522248
      inSlope: -0.06624394
      outSlope: -0.06624394
      tangentMode: 0
      weightedMode: 0
      inWeight: 0.33333334
      outWeight: 0.10492218
    - serializedVersion: 3
      time: 0.723834
      value: 0.67172885
      inSlope: -0.0017171904
      outSlope: -0.0017171904
      tangentMode: 0
      weightedMode: 0
      inWeight: 0.33333334
      outWeight: 0.177506
    - serializedVersion: 3
      time: 1
      value: 0.66908264
      inSlope: -0.009581946
      outSlope: -0.009581946
      tangentMode: 34
      weightedMode: 0
      inWeight: 0.33333334
      outWeight: 0
    m_PreInfinity: 2
    m_PostInfinity: 2
    m_RotationOrder: 4
  mountainAnim:
    serializedVersion: 2
    m_Curve:
    - serializedVersion: 3
      time: 0
      value: 1
      inSlope: 0
      outSlope: 0
      tangentMode: 34
      weightedMode: 0
      inWeight: 0
      outWeight: 0.33333334
    - serializedVersion: 3
      time: 0.13043478
      value: 1
      inSlope: -0.06918451
      outSlope: -0.06918451
      tangentMode: 0
      weightedMode: 0
      inWeight: 0.33333334
      outWeight: 0.033593744
    - serializedVersion: 3
      time: 0.3266094
      value: 1.0025419
      inSlope: 0.045709684
      outSlope: 0.045709684
      tangentMode: 0
      weightedMode: 0
      inWeight: 0.33333334
      outWeight: 0.08855713
    - serializedVersion: 3
      time: 0.66097933
      value: 1.0019941
      inSlope: -0.0062844562
      outSlope: -0.0062844562
      tangentMode: 0
      weightedMode: 0
      inWeight: 0.09820017
      outWeight: 0.07322835
    - serializedVersion: 3
      time: 1
      value: 1
      inSlope: -0.0058820397
      outSlope: -0.0058820397
      tangentMode: 34
      weightedMode: 0
      inWeight: 0.33333334
      outWeight: 0
    m_PreInfinity: 2
    m_PostInfinity: 2
    m_RotationOrder: 4
  roughAnim:
    serializedVersion: 2
    m_Curve:
    - serializedVersion: 3
      time: 0
      value: -0.0031433105
      inSlope: 0.01230473
      outSlope: 0.01230473
      tangentMode: 34
      weightedMode: 0
      inWeight: 0
      outWeight: 0.33333334
    - serializedVersion: 3
      time: 0.4667052
      value: 0.0025993707
      inSlope: 0.11015847
      outSlope: -0.041830473
      tangentMode: 1
      weightedMode: 0
      inWeight: 0.08098922
      outWeight: 1
    - serializedVersion: 3
      time: 0.5050143
      value: 0.00020855665
      inSlope: -0.062408518
      outSlope: 0.02994862
      tangentMode: 69
      weightedMode: 0
      inWeight: 0.33333334
      outWeight: 0.33333334
    - serializedVersion: 3
      time: 0.54723006
      value: 0.0014728606
      inSlope: 0.02994862
      outSlope: -0.047238737
      tangentMode: 69
      weightedMode: 0
      inWeight: 0.33333334
      outWeight: 0.33333334
    - serializedVersion: 3
      time: 0.5713137
      value: 0.00033518102
      inSlope: -0.047238737
      outSlope: -0.008114305
      tangentMode: 69
      weightedMode: 0
      inWeight: 0.33333334
      outWeight: 0.33333334
    - serializedVersion: 3
      time: 1
      value: -0.0031433105
      inSlope: -0.008114305
      outSlope: -0.008114305
      tangentMode: 34
      weightedMode: 0
      inWeight: 0.33333334
      outWeight: 0
    m_PreInfinity: 2
    m_PostInfinity: 2
    m_RotationOrder: 4
  flatAnim:
    serializedVersion: 2
    m_Curve:
    - serializedVersion: 3
      time: 0
      value: 0.0016937256
      inSlope: 0
      outSlope: 0
      tangentMode: 34
      weightedMode: 0
      inWeight: 0
      outWeight: 0.33333334
    - serializedVersion: 3
      time: 1
      value: 0.0016937256
      inSlope: 0
      outSlope: 0
      tangentMode: 34
      weightedMode: 0
      inWeight: 0.33333334
      outWeight: 0
    m_PreInfinity: 2
    m_PostInfinity: 2
    m_RotationOrder: 4
  seed: 20000
