%YAML 1.1
%TAG !u! tag:unity3d.com,2011:
--- !u!114 &11400000
MonoBehaviour:
  m_ObjectHideFlags: 0
  m_CorrespondingSourceObject: {fileID: 0}
  m_PrefabInstance: {fileID: 0}
  m_PrefabAsset: {fileID: 0}
  m_GameObject: {fileID: 0}
  m_Enabled: 1
  m_EditorHideFlags: 0
  m_Script: {fileID: 11500000, guid: c70436bb1eaa8234dbe913514fe825a5, type: 3}
  m_Name: TestNoiseGen
  m_EditorClassIdentifier: 
  octaves: 5
  lacunarity: 4.67
  persistance: 0.3
  frequencyModifier: 0.002
  amplitudeModifier: 20
  horizontalMod: 0
  seaAnim:
    serializedVersion: 2
    m_Curve:
    - serializedVersion: 3
      time: 0
      value: -0.08711243
      inSlope: 0
      outSlope: 0
      tangentMode: 34
      weightedMode: 0
      inWeight: 0
      outWeight: 0.33333334
    - serializedVersion: 3
      time: 1
      value: -0.08711243
      inSlope: 0
      outSlope: 0
      tangentMode: 34
      weightedMode: 0
      inWeight: 0.33333334
      outWeight: 0
    m_PreInfinity: 2
    m_PostInfinity: 2
    m_RotationOrder: 4
  coastAnim:
    serializedVersion: 2
    m_Curve:
    - serializedVersion: 3
      time: 0
      value: 0.061309814
      inSlope: 0.22821134
      outSlope: 0.22821134
      tangentMode: 34
      weightedMode: 0
      inWeight: 0
      outWeight: 0.33333334
    - serializedVersion: 3
      time: 0.313421
      value: 0.13283604
      inSlope: 0.16586334
      outSlope: 0.16586334
      tangentMode: 34
      weightedMode: 0
      inWeight: 0.33333334
      outWeight: 0.33333334
    - serializedVersion: 3
      time: 0.52298754
      value: 0.1545294
      inSlope: -0.024064288
      outSlope: -0.024064288
      tangentMode: 34
      weightedMode: 0
      inWeight: 0.33333334
      outWeight: 0.33333334
    - serializedVersion: 3
      time: 0.7677299
      value: 0.11741571
      inSlope: 0.29191917
      outSlope: 0.29191917
      tangentMode: 34
      weightedMode: 0
      inWeight: 0.33333334
      outWeight: 0.33333334
    - serializedVersion: 3
      time: 1.0042114
      value: 0.2913437
      inSlope: 0.7354822
      outSlope: 0.7354822
      tangentMode: 34
      weightedMode: 0
      inWeight: 0.33333334
      outWeight: 0
    m_PreInfinity: 2
    m_PostInfinity: 2
    m_RotationOrder: 4
  lowlandAnim:
    serializedVersion: 2
    m_Curve:
    - serializedVersion: 3
      time: 0
      value: 0.13330078
      inSlope: 0.850703
      outSlope: 0.850703
      tangentMode: 34
      weightedMode: 0
      inWeight: 0
      outWeight: 0.33333334
    - serializedVersion: 3
      time: 0.35243496
      value: 0.43311825
      inSlope: -0.07584492
      outSlope: -0.07584492
      tangentMode: 0
      weightedMode: 0
      inWeight: 0.33333334
      outWeight: 0.047829203
    - serializedVersion: 3
      time: 0.71682566
      value: 0.25452664
      inSlope: -0.46642697
      outSlope: -0.46642697
      tangentMode: 0
      weightedMode: 0
      inWeight: 0.06485974
      outWeight: 0.33333334
    - serializedVersion: 3
      time: 1
      value: 0.43488312
      inSlope: 0.63690966
      outSlope: 0.63690966
      tangentMode: 34
      weightedMode: 0
      inWeight: 0.33333334
      outWeight: 0
    m_PreInfinity: 2
    m_PostInfinity: 2
    m_RotationOrder: 4
  midlandAnim:
    serializedVersion: 2
    m_Curve:
    - serializedVersion: 3
      time: 0
      value: 0.39736938
      inSlope: 0.45521554
      outSlope: 0.45521554
      tangentMode: 34
      weightedMode: 0
      inWeight: 0
      outWeight: 0.33333334
    - serializedVersion: 3
      time: 0.544394
      value: 0.645186
      inSlope: -0.23172684
      outSlope: -0.23172684
      tangentMode: 0
      weightedMode: 0
      inWeight: 0.33333334
      outWeight: 0.06749674
    - serializedVersion: 3
      time: 0.9958496
      value: 0.89696455
      inSlope: 0.5577039
      outSlope: 0.5577039
      tangentMode: 34
      weightedMode: 0
      inWeight: 0.33333334
      outWeight: 0
    m_PreInfinity: 2
    m_PostInfinity: 2
    m_RotationOrder: 4
  highlandAnim:
    serializedVersion: 2
    m_Curve:
    - serializedVersion: 3
      time: 0
      value: 0.6008606
      inSlope: 0.08239667
      outSlope: 0.08239667
      tangentMode: 34
      weightedMode: 0
      inWeight: 0
      outWeight: 0.33333334
    - serializedVersion: 3
      time: 0.4204453
      value: 0.6355039
      inSlope: 0.3134752
      outSlope: 0.3134752
      tangentMode: 0
      weightedMode: 0
      inWeight: 0.33333334
      outWeight: 0.33333334
    - serializedVersion: 3
      time: 0.5741953
      value: 0.92471874
      inSlope: 0.088303395
      outSlope: 0.088303395
      tangentMode: 0
      weightedMode: 0
      inWeight: 0.33333334
      outWeight: 0.061664604
    - serializedVersion: 3
      time: 0.85415316
      value: 0.8720525
      inSlope: 0.20592353
      outSlope: 0.20592353
      tangentMode: 0
      weightedMode: 0
      inWeight: 0.33333334
      outWeight: 0.33333334
    - serializedVersion: 3
      time: 1
      value: 1.0089493
      inSlope: 0.93863386
      outSlope: 0.93863386
      tangentMode: 34
      weightedMode: 0
      inWeight: 0.33333334
      outWeight: 0
    m_PreInfinity: 2
    m_PostInfinity: 2
    m_RotationOrder: 4
  mountainAnim:
    serializedVersion: 2
    m_Curve:
    - serializedVersion: 3
      time: 0
      value: 1.00531
      inSlope: 0.48494524
      outSlope: 0.48494524
      tangentMode: 34
      weightedMode: 0
      inWeight: 0
      outWeight: 0.33333334
    - serializedVersion: 3
      time: 0.4074053
      value: 1.2028793
      inSlope: 0.35731566
      outSlope: 0.35731566
      tangentMode: 34
      weightedMode: 0
      inWeight: 0.33333334
      outWeight: 0.33333334
    - serializedVersion: 3
      time: 0.7236114
      value: 1.2755075
      inSlope: 0.5131718
      outSlope: 0.5131718
      tangentMode: 34
      weightedMode: 0
      inWeight: 0.33333334
      outWeight: 0.33333334
    - serializedVersion: 3
      time: 0.9971924
      value: 1.4934578
      inSlope: 0.79665756
      outSlope: 0.79665756
      tangentMode: 34
      weightedMode: 0
      inWeight: 0.33333334
      outWeight: 0
    m_PreInfinity: 2
    m_PostInfinity: 2
    m_RotationOrder: 4
  roughAnim:
    serializedVersion: 2
    m_Curve:
    - serializedVersion: 3
      time: 0
      value: 0.0010223389
      inSlope: 0.047831777
      outSlope: 0.047831777
      tangentMode: 34
      weightedMode: 0
      inWeight: 0
      outWeight: 0.33333334
    - serializedVersion: 3
      time: 0.18558803
      value: 0.009899344
      inSlope: -0.0015626226
      outSlope: -0.0015626226
      tangentMode: 1
      weightedMode: 0
      inWeight: 0.33333334
      outWeight: 0.33333334
    - serializedVersion: 3
      time: 0.29095536
      value: -0.0070574647
      inSlope: -0.0015626218
      outSlope: -0.0015626218
      tangentMode: 1
      weightedMode: 0
      inWeight: 0.33333334
      outWeight: 0.33333334
    - serializedVersion: 3
      time: 0.5077728
      value: 0.00022888184
      inSlope: 0.033605907
      outSlope: 3.1901495
      tangentMode: 69
      weightedMode: 0
      inWeight: 0.33333334
      outWeight: 0.33333334
    - serializedVersion: 3
      time: 0.5119909
      value: 0.013685256
      inSlope: 3.1901495
      outSlope: 0.016271116
      tangentMode: 69
      weightedMode: 0
      inWeight: 0.33333334
      outWeight: 0.33333334
    - serializedVersion: 3
      time: 0.67879736
      value: 0.016399384
      inSlope: 0.016271116
      outSlope: -3.9240103
      tangentMode: 69
      weightedMode: 0
      inWeight: 0.33333334
      outWeight: 0.33333334
    - serializedVersion: 3
      time: 0.6829228
      value: 0.0002112079
      inSlope: -3.9240103
      outSlope: 0.0025581496
      tangentMode: 69
      weightedMode: 0
      inWeight: 0.33333334
      outWeight: 0.33333334
    - serializedVersion: 3
      time: 1
      value: 0.0010223389
      inSlope: 0.0025581496
      outSlope: 0.0025581496
      tangentMode: 34
      weightedMode: 0
      inWeight: 0.33333334
      outWeight: 0
    m_PreInfinity: 2
    m_PostInfinity: 2
    m_RotationOrder: 4
  flatAnim:
    serializedVersion: 2
    m_Curve:
    - serializedVersion: 3
      time: 0
      value: 0.0039100647
      inSlope: 0
      outSlope: 0
      tangentMode: 34
      weightedMode: 0
      inWeight: 0
      outWeight: 0.33333334
    - serializedVersion: 3
      time: 1
      value: 0.0039100647
      inSlope: 0
      outSlope: 0
      tangentMode: 34
      weightedMode: 0
      inWeight: 0.33333334
      outWeight: 0
    m_PreInfinity: 2
    m_PostInfinity: 2
    m_RotationOrder: 4
  deepSeaAnim:
    serializedVersion: 2
    m_Curve: []
    m_PreInfinity: 2
    m_PostInfinity: 2
    m_RotationOrder: 4
