%YAML 1.1
%TAG !u! tag:unity3d.com,2011:
--- !u!114 &11400000
MonoBehaviour:
  m_ObjectHideFlags: 0
  m_CorrespondingSourceObject: {fileID: 0}
  m_PrefabInstance: {fileID: 0}
  m_PrefabAsset: {fileID: 0}
  m_GameObject: {fileID: 0}
  m_Enabled: 1
  m_EditorHideFlags: 0
  m_Script: {fileID: 11500000, guid: bca277cd628ad9a40b8c07f2cccc7a3a, type: 3}
  m_Name: Environment
  m_EditorClassIdentifier: 
  source: {fileID: 11400000, guid: a2dbc98e51292ce4cbfde4be49730789, type: 2}
  detailSource: {fileID: 11400000, guid: 29df72b99f70e6d4b83bc6782b4660f5, type: 2}
