<?xml version="1.0" encoding="utf-8"?>
<!-- Generator: Adobe Illustrator 21.1.0, SVG Export Plug-In . SVG Version: 6.00 Build 0)  -->
<svg version="1.1" id="Calque_1" xmlns="http://www.w3.org/2000/svg" xmlns:xlink="http://www.w3.org/1999/xlink" x="0px" y="0px"
	 viewBox="20 20 101.7 101.7" style="enable-background:new 0 0 141.7 141.7;fill:#ffffff;" xml:space="preserve">
<style type="text/css">
	.st0{fill:none;stroke:#ffffff;stroke-width:5;stroke-miterlimit:10;}
</style>
<path d="M55.1,78.3c0-1.9,0.7-3.5,2-4.9l14.4-14.2c1.7-1.7,3.8-2.6,6.3-2.6c2.5,0,4.6,0.9,6.3,2.6c1.7,1.7,2.6,3.8,2.6,6.3
	c0,2.5-0.9,4.6-2.6,6.3L73.2,82.5c-0.4,0.5-0.9,0.5-1.4,0c-0.5-0.5-0.5-0.9,0-1.4l10.7-10.7c1.4-1.3,2.1-2.9,2.1-4.8
	c0-1.9-0.7-3.5-2.1-4.9c-1.4-1.4-3-2.1-4.9-2c-1.9,0-3.5,0.7-4.8,2L58.5,74.8c-0.9,0.9-1.4,2.1-1.4,3.4c0,1.3,0.5,2.5,1.4,3.5
	c0.9,1,2.1,1.5,3.5,1.5c1.4,0,2.5-0.5,3.4-1.4l14.4-14.2c0.6-0.6,0.9-1.3,0.9-2.1s-0.3-1.5-0.9-2.1c-0.6-0.6-1.3-0.9-2.1-0.9
	c-0.8,0-1.5,0.3-2.1,0.9L64.9,74.2c-0.5,0.5-1,0.5-1.4,0c-0.4-0.5-0.4-0.9,0-1.4l10.8-10.9c1-0.9,2.2-1.4,3.5-1.4s2.5,0.5,3.5,1.4
	c0.9,0.9,1.4,2.1,1.5,3.5c0,1.4-0.5,2.6-1.4,3.5L66.9,83.1c-1.3,1.4-3,2.1-4.9,2.1c-1.9,0-3.5-0.7-4.9-2
	C55.8,81.8,55.1,80.2,55.1,78.3z"/>
<circle class="st0" cx="70.9" cy="70.9" r="41"/>
</svg>
