\relax 
\citation{SHiP}
\citation{Collins1985}
\citation{SHiP,US}
\citation{SeaQuest}
\newlabel{FirstPage}{{}{1}{}{}{}}
\@writefile{toc}{\contentsline {title}{Dark photon production, NLO}{1}{}}
\@writefile{toc}{\contentsline {abstract}{Abstract}{1}{}}
\@writefile{toc}{\contentsline {section}{\numberline {I}Introduction}{1}{}}
\newlabel{sec:intro}{{I}{1}{}{}{}}
\@writefile{toc}{\contentsline {subsection}{\numberline {A}Dark photons}{1}{}}
\newlabel{subsec:dark_photons}{{I\tmspace  +\thinmuskip {.1667em}A}{1}{}{}{}}
\@writefile{toc}{\contentsline {subsection}{\numberline {B}Direct production}{1}{}}
\newlabel{subsec:direct_production}{{I\tmspace  +\thinmuskip {.1667em}B}{1}{}{}{}}
\citation{Pospelov}
\citation{Blumlein}
\citation{FieldBook}
\citation{Handbook}
\citation{Collins1985}
\citation{Collins2003}
\citation{Collins1989}
\citation{Maltoni}
\citation{EllisBook}
\@writefile{lof}{\contentsline {figure}{\numberline {1}{\ignorespaces SHiP experiment setup and the three dominant production channels depending on the dark photon mass. \leavevmode {\color  {red}Mensuration of the experiment ?}.}}{2}{}}
\newlabel{fig:setup}{{1}{2}{}{}{}}
\@writefile{toc}{\contentsline {section}{\numberline {II}Hard production}{2}{}}
\newlabel{sec:hard_production}{{II}{2}{}{}{}}
\@writefile{toc}{\contentsline {subsection}{\numberline {A}Theory}{2}{}}
\newlabel{subsec:theory}{{II\tmspace  +\thinmuskip {.1667em}A}{2}{}{}{}}
\@writefile{toc}{\contentsline {subsubsection}{\numberline {1}Leading order}{2}{}}
\newlabel{subsubsec:leading_order}{{II\tmspace  +\thinmuskip {.1667em}A\tmspace  +\thinmuskip {.1667em}1}{2}{}{}{}}
\newlabel{eq:LABmomentum}{{2}{2}{}{}{}}
\citation{EllisBook}
\citation{}
\citation{}
\citation{Handbook}
\newlabel{eq:NPM}{{4}{3}{}{}{}}
\@writefile{toc}{\contentsline {subsubsection}{\numberline {2}Next-to-leading order}{3}{}}
\newlabel{subsubsec:next_to_leading_order}{{II\tmspace  +\thinmuskip {.1667em}A\tmspace  +\thinmuskip {.1667em}2}{3}{}{}{}}
\@writefile{toc}{\contentsline {paragraph}{\numberline {a}Integrated cross section}{3}{}}
\newlabel{eq:intNLO}{{5}{3}{}{}{}}
\@writefile{toc}{\contentsline {paragraph}{\numberline {b}Differential cross section}{3}{}}
\citation{Collins1985}
\citation{PerfectDY}
\citation{Collins1985}
\citation{Landry2003}
\citation{Konychev2006}
\citation{Landry2003}
\citation{Konychev2006}
\@writefile{lof}{\contentsline {figure}{\numberline {2}{\ignorespaces (a) NLO loop corrections. (b) NLO two-particle final states: Each diagram is accompanied by a cross channel.}}{4}{}}
\newlabel{fig:diagrams}{{2}{4}{}{}{}}
\newlabel{eq:NLO}{{9}{4}{}{}{}}
\@writefile{toc}{\contentsline {paragraph}{\numberline {c}CSS resummation}{4}{}}
\newlabel{eq:CSS}{{10}{4}{}{}{}}
\newlabel{eq:W}{{11}{4}{}{}{}}
\citation{}
\citation{Collins1985}
\citation{Boglione2014}
\@writefile{toc}{\contentsline {subsubsection}{\numberline {3}Matching small and large $k_T$ regimes}{5}{}}
\newlabel{subsubsec:matching_small_and_large_kT_regimes}{{II\tmspace  +\thinmuskip {.1667em}A\tmspace  +\thinmuskip {.1667em}3}{5}{}{}{}}
\newlabel{fig:matching}{{II\tmspace  +\thinmuskip {.1667em}A\tmspace  +\thinmuskip {.1667em}3}{5}{}{}{}}
\@writefile{lof}{\contentsline {figure}{\numberline {3}{\ignorespaces Differential cross section predicted by the three differnent expressions: NLO, DIV and CSS. The success / failure of the convergence $d\sigma _{NLO} \xrightarrow {k_T \ll \Lambda _{QCD}} d\sigma _{DIV}$ / $d\sigma _{CSS} \xrightarrow {k_T \gg \Lambda _{QCD}} d\sigma _{DIV}$ are illustrated. The transition momenta $k_{T1}$ and $k_{T2}$ are also depicted.}}{5}{}}
\@writefile{toc}{\contentsline {subsection}{\numberline {B}Implementation}{5}{}}
\newlabel{subsec:implementation}{{II\tmspace  +\thinmuskip {.1667em}B}{5}{}{}{}}
\@writefile{toc}{\contentsline {subsubsection}{\numberline {1}Fitting procedure}{5}{}}
\newlabel{subsubsec:fitting_procedure}{{II\tmspace  +\thinmuskip {.1667em}B\tmspace  +\thinmuskip {.1667em}1}{5}{}{}{}}
\citation{LHAPDF6}
\citation{CT14}
\citation{}
\citation{Konychev2006}
\citation{}
\citation{Hamberg_1990}
\@writefile{toc}{\contentsline {subsubsection}{\numberline {2}Cross sections}{6}{}}
\newlabel{subsubsec:cross_sections}{{II\tmspace  +\thinmuskip {.1667em}B\tmspace  +\thinmuskip {.1667em}2}{6}{}{}{}}
\@writefile{toc}{\contentsline {subsubsection}{\numberline {3}Uncertainties and approximations}{6}{}}
\newlabel{subsubsec:uncertainties_and_approximations}{{II\tmspace  +\thinmuskip {.1667em}B\tmspace  +\thinmuskip {.1667em}3}{6}{}{}{}}
\@writefile{toc}{\contentsline {paragraph}{\numberline {a}PDF uncertainties}{6}{}}
\@writefile{toc}{\contentsline {paragraph}{\numberline {b}Scale uncertainties}{6}{}}
\@writefile{toc}{\contentsline {paragraph}{\numberline {c}Parametrization scheme uncertainties}{6}{}}
\@writefile{toc}{\contentsline {paragraph}{\numberline {d}Numerical errors}{6}{}}
\@writefile{toc}{\contentsline {paragraph}{\numberline {e}Simplificative assumptions}{6}{}}
\@writefile{toc}{\contentsline {paragraph}{\numberline {f}Domain squeezing}{6}{}}
\citation{PerfectDY}
\newlabel{fig:ds_dzdkT}{{II\tmspace  +\thinmuskip {.1667em}B\tmspace  +\thinmuskip {.1667em}2}{7}{}{}{}}
\@writefile{lof}{\contentsline {figure}{\numberline {4}{\ignorespaces Double differential cross section. Superior (full) and inferior (dashed) predictions of the transverse profile are illustrated for a set of masses and longitudinal fractions.}}{7}{}}
\@writefile{toc}{\contentsline {subsubsection}{\numberline {4}Time consumption}{7}{}}
\newlabel{subsubsec:time_consumption}{{II\tmspace  +\thinmuskip {.1667em}B\tmspace  +\thinmuskip {.1667em}4}{7}{}{}{}}
\@writefile{toc}{\contentsline {section}{\numberline {III}SHiP sensitivity}{7}{}}
\newlabel{sec:ship_sensitivity}{{III}{7}{}{}{}}
\@writefile{toc}{\contentsline {section}{\numberline {IV}A comment on bremsstrahlung}{7}{}}
\newlabel{sec:a_comment_on_bremsstrahlung}{{IV}{7}{}{}{}}
\@writefile{toc}{\contentsline {section}{\numberline {V}Conclusions}{7}{}}
\newlabel{sec:conclusions}{{V}{7}{}{}{}}
\@writefile{toc}{\contentsline {section}{\numberline {VI}Appendix}{7}{}}
\newlabel{sec:appendix}{{VI}{7}{}{}{}}
\@writefile{toc}{\contentsline {subsection}{\numberline {A}Parton dynamics}{7}{}}
\newlabel{ap:parton_dynamics}{{VI\tmspace  +\thinmuskip {.1667em}A}{7}{}{}{}}
\newlabel{fig:ds_dz}{{II\tmspace  +\thinmuskip {.1667em}B\tmspace  +\thinmuskip {.1667em}2}{8}{}{}{}}
\@writefile{lof}{\contentsline {figure}{\numberline {5}{\ignorespaces Single differential cross section. The NPM prediction (full line) lies between the $INF$ and $SUP$ predictions (shade). These are obtained by numerically integrating the differential cross section along $k_T$.}}{8}{}}
\newlabel{fig:sigma}{{II\tmspace  +\thinmuskip {.1667em}B\tmspace  +\thinmuskip {.1667em}2}{8}{}{}{}}
\@writefile{lof}{\contentsline {figure}{\numberline {6}{\ignorespaces Integrated cross section. The NPM and NLO predictions (full lines) together with their scale and PDF uncertainties (shades) are compared to the $INF$ and $SUP$ predictions (obtained by numerical integration).}}{8}{}}
\newlabel{eq:F}{{15}{8}{}{}{}}
\newlabel{eq:physical_domain}{{16}{8}{}{}{}}
\@writefile{toc}{\contentsline {subsection}{\numberline {B}Sample distribution}{8}{}}
\newlabel{ap:sample_distribution}{{VI\tmspace  +\thinmuskip {.1667em}B}{8}{}{}{}}
\bibdata{DarkPhotonProductionNotes,references}
\bibcite{SHiP}{{1}{}{{}}{{}}}
\bibcite{Collins1985}{{2}{}{{}}{{}}}
\bibcite{US}{{3}{}{{}}{{}}}
\bibcite{SeaQuest}{{4}{}{{}}{{}}}
\bibcite{Pospelov}{{5}{}{{}}{{}}}
\bibcite{Blumlein}{{6}{}{{}}{{}}}
\bibcite{FieldBook}{{7}{}{{}}{{}}}
\bibcite{Handbook}{{8}{}{{}}{{}}}
\bibcite{Collins2003}{{9}{}{{}}{{}}}
\bibcite{Collins1989}{{10}{}{{}}{{}}}
\bibcite{Maltoni}{{11}{}{{}}{{}}}
\newlabel{fig:distribution}{{VI\tmspace  +\thinmuskip {.1667em}B}{9}{}{}{}}
\@writefile{lof}{\contentsline {figure}{\numberline {7}{\ignorespaces Above: Shift and normalization of the distribution function depending on the choice of the last step size $dx$. The other parameters are $x_{min}=0$, $x_{max}=10$, $x_0=2$, $\sigma =4$ and $N=100$. Only the region where the blue curve is larger than the dashed line corresponds to admissible values of $dx$. Below: Representation of the distributed $N$ coordinates for three different values of $dx$.}}{9}{}}
\@writefile{toc}{\contentsline {subsection}{\numberline {C}Numerical errors}{9}{}}
\newlabel{ap:numerical_errors}{{VI\tmspace  +\thinmuskip {.1667em}C}{9}{}{}{}}
\newlabel{fig:errors}{{VI\tmspace  +\thinmuskip {.1667em}C}{9}{}{}{}}
\@writefile{lof}{\contentsline {figure}{\numberline {8}{\ignorespaces }}{9}{}}
\@writefile{toc}{\contentsline {section}{\numberline {}References}{9}{}}
\bibcite{EllisBook}{{12}{}{{}}{{}}}
\bibcite{PerfectDY}{{13}{}{{}}{{}}}
\bibcite{Landry2003}{{14}{}{{}}{{}}}
\bibcite{Konychev2006}{{15}{}{{}}{{}}}
\bibcite{Boglione2014}{{16}{}{{}}{{}}}
\bibcite{LHAPDF6}{{17}{}{{}}{{}}}
\bibcite{CT14}{{18}{}{{}}{{}}}
\bibcite{Hamberg_1990}{{19}{}{{}}{{}}}
\bibstyle{unsrt}
\providecommand\NAT@force@numbers{}\NAT@force@numbers
\newlabel{LastBibItem}{{19}{10}{}{}{}}
\newlabel{LastPage}{{}{10}{}{}{}}
