<?xml version="1.0" encoding="UTF-8" standalone="no"?>
<!-- Created with Inkscape (http://www.inkscape.org/) -->

<svg
   xmlns:dc="http://purl.org/dc/elements/1.1/"
   xmlns:cc="http://creativecommons.org/ns#"
   xmlns:rdf="http://www.w3.org/1999/02/22-rdf-syntax-ns#"
   xmlns:svg="http://www.w3.org/2000/svg"
   xmlns="http://www.w3.org/2000/svg"
   xmlns:xlink="http://www.w3.org/1999/xlink"
   xmlns:sodipodi="http://sodipodi.sourceforge.net/DTD/sodipodi-0.dtd"
   xmlns:inkscape="http://www.inkscape.org/namespaces/inkscape"
   width="210mm"
   height="297mm"
   viewBox="0 0 210 297"
   version="1.1"
   id="svg982"
   inkscape:version="0.92.4 (f8dce91, 2019-08-02)"
   sodipodi:docname="uncertainty_table.svg">
  <defs
     id="defs976" />
  <sodipodi:namedview
     id="base"
     pagecolor="#ffffff"
     bordercolor="#666666"
     borderopacity="1.0"
     inkscape:pageopacity="0.0"
     inkscape:pageshadow="2"
     inkscape:zoom="1.4"
     inkscape:cx="271.82403"
     inkscape:cy="673.28323"
     inkscape:document-units="mm"
     inkscape:current-layer="layer1"
     showgrid="false"
     inkscape:window-width="1853"
     inkscape:window-height="1025"
     inkscape:window-x="67"
     inkscape:window-y="27"
     inkscape:window-maximized="1" />
  <metadata
     id="metadata979">
    <rdf:RDF>
      <cc:Work
         rdf:about="">
        <dc:format>image/svg+xml</dc:format>
        <dc:type
           rdf:resource="http://purl.org/dc/dcmitype/StillImage" />
        <dc:title></dc:title>
      </cc:Work>
    </rdf:RDF>
  </metadata>
  <g
     inkscape:label="Layer 1"
     inkscape:groupmode="layer"
     id="layer1">
    <image
       y="64.24585"
       x="44.93417"
       id="image1730"
       xlink:href="data:image/png;base64,iVBORw0KGgoAAAANSUhEUgAAAOEAAADECAYAAABp0kb/AAAABHNCSVQICAgIfAhkiAAAEABJREFU eJztnftxGzkSxj9vbQBT2gzoDHgOgZuB7MtAzkCOQZeB9yLYkjOQM/ByM6AyOFMZ6P4YYgmB3Rg8 GvPgfL+qKVNjEoPpQaMfeMw7kKnpAGwA3Hiffzv9253Ou89/APg8TTUJuU6+AnjNOB6nqSYh18sR eUp4N001SUveTV2BlbMDsEXvfjrXc3f6LPEewPM4VSNk3UgW8jhpjUgzfpm6AiSZ71NXgLSBSjg/ Osju6NPYFSFkrdxCTspspqwUaQct4fz4XTj3AiZkCBmNAzg+uCpoCeeFmzETwniQkJFgPLhCaAnn BeNBQiZGigfpil45tITzgfHgSqESzoedcp4zZQgZCW1ZEyFkJBgPrhS6o/OA8eCKoRLOA8aDhEwM 40FCDLlFP9fzgPPi3P3pnGbxGA8SUkkH4B76ivhQubrgt5IVvB+p3nfoLbHfaVgfB/SdEyFNuIe8 6mEbfG+Hs8U74KyI2nzR8PeW7NBb5xYKpx3cnoOY06G3amGPr7mcDveb/envMePBLWTXd6yDEDN2 uHTd9tFfvMUpwh3GiwcfhOuMeXxtcE9kpWwhxzzaNoUSO6EM/7CMBzdIdz1zYsJD4vEE7pdKDJEU 8Ig8BXTE3EKreHCDuGI9oo9Jw/p3p/Mx5W0ZsxIiIingK4ZjQA0poWMZO8UU8CGjnDulDA6hkNGx 3vtFU2qLxq0p4AFlq/S1DoPWkIyGlMEsdUMdG6FMq3hQ6jByEkepZTLZQkZBS6LkuHQ55Za6t45H oczcxJGE5JYeKsskJAktrqrdfEkbMqih5UZRmuWuVW5ComixUK1rB8iZx5pyO8gdhuXwAONCMjqa FbSYB2nt4kpxq7W72EoWhIhoqXkLF8w6HtQmgVsPko9xDUL+QbOCFq6odTwolddiwjQtIRkNbQzv FTZDCJbx4FhLobTEDGPCSri9hcy/I/9nseWE1HBLy/2knP9WWJ6GlmF9Mb4OIQD0OZMWLp51PBgu p2qRkAH0TDEh5mju3StsXlFmHQ9aZ1k1pEkAXKhrAN3RSz5E/u+HQfmSxfu7sCwtKdJicrVUb+4G ZwCV8JLY7JLaRtfBNh7U6mqtHBvIwzJ/Gl9nlVAJL4mNAZZaLIdmZUst13vhXIvXqGkW1zr5s0qo hJdIDRuoV0BAfv8gYGsJLeoZ8lk4R1fUCCrhJTfK+b8Myi6JB3e43CbRISmhtSXcKNdpkfxZJVTC dGrHw0rjwQf0iigpglQn6+EJzQrSEhpBJbxEsyS1jbskHvQVV7KYPxPPleI2NQ75YniN1UMlvOR/ yvlaN++jcj7m5jr3VbM6rd9lL7mc39Am7iTkH7R5o7VzJLU9X2K4AXJtHqi0iNdqVYM0acFihT4h SVivFtB22R7ao8UprjYeKCmKVcJEmg5nsUKfkCSkKVqlFia2LjG20sHNMR2aGhYqi8VsGanT4JIl MiqSS1oyb1Tb8yVFsV1HMGTZpLrWuIxSpzHGG6IIuUBaSZGDv1rCvX4sVQl9NzPFBQwtd6lLKnUa tIBkMqRFrKkN0rcmzopIFkuzME5hU11LaZOn3ESS1EnUbr9ISDWhZTgibpk6vLVKoaUL4zfJxfUt aE4iJNx1+4g0RZTeVfiUeW1CmiIpYmgRN3hrSQ7QFSDcydovy79WSRzWCeV/FeqygfzCl5T3KxIy CdrrxaSxvyHlCa2lVE5tIuROqVts8yrumkYWwRa9Zdnj3KCPOL+DL/cdha4sZ4Wk12zX4F/Dr+/+ dK17cPCdEEIIIYQQQgghhBBCCCGEEEIIIYQQQgghhBBCCCGEEEIIIYQQQgghhBBCCCGEEEIIIYQQ QgghhBBCCCGEEEIIIYQQQgghpJp36F8cSQiZiF+mrgAha4dKSMjEUAkJIYQQQgghhBBCCCGEEEII IYQQQsi6eDd1BQgZiR2AjwA+ANgA6E7nnwG8APgO4AeAb5PUjpAr5h7AEf1qodTjK3pFJYRUsAFw wFmxDugVcnf6v83p80PwPf+4H73WhFwJW7xVvm3Cb24hW8ynRnUk5GrZ4KxMTzjHfrm/pSISUsge veLsC3/vW1G6poRkcouz0uRYwJAHyIrIZA0hAzyhV5bHynI6yEr4UFkuIVeNpDhfK8pzCu0fx8o6 ivzaotAMOvQm/sb7/BvOg6k33uc/AHyeppqLo7Vc3W/9a7wPruc+j/XcJFfxDn129D8F5T2hH8Lw 6U7HS0F5s+Qr8gZQa12MtdBaro+Nyy9lp1y/NEFzp5SXMtyRxZQbPX3K/D7TxGm0lmtoHazLL+U5 8/wQP5XzN4XlqUzpjn5E36v8hrOLtIOe1fo+Ur2WTmu5zvW5PZ+O0C39s7A8Tdk05bwqpMHSJgHx ymgt1zk8tw7nhMoBvUtZijZMUTP0ITJ1YiYVWsE2tJbr2M/tBcDvRmVJbrdbcWHK3Db/ddmnEMaD dbSW67U9tw5yAmYVy5z8GQ+cqWBHa7lqmUnzTOJIjOaKzhEpvc54sJ7WctUa7RJZ/WwZaV0Xxwfr aS1XN2naP5bqikodymHSGo2I1gPVZLhIe7lq5S9x1YG0guKIlbihAOPBVjAeTCccZjliZe2P8WAb GA+mEU7YPmKZHUkVUtyy1LhiTrSW6zXEg2FHdcDKLCBwXXHFnGgt12t4bqElz90S42rQ4pbVuQPG tJbr0uPBUAFr1h8uHm35DamjtVyXHA+GdV99Fp7xYBsYD8r4CrjKBEzINcQVc4TxoIyvgHusNP4L YTzYhqniwdxFv2PiK2Cuxb7DFW+Pz3iwDYwH3+LXtyQB41z72SvhLfo5iQecZx/sT+e0HnLsePD2 VL677gH9QylxS9yOza2zanOUqxQPlu7n0qF3Y/c4398R/f1ZNHpfAUvd5Vl3Mk6A2srqsBF0wW/H iit2Sh1rXCnX0FvUd85ytVpp0EGf0eP/bbVC/rawDOd6z3Ii9z0uBfiIy7hjh7eWxzWYseJBqZ61 iugebosHM3e5WsSDfqd4RH/PoTfi73hWUnf3jGozoK6cWa3o8ffycMcBww/B/ca5LWPEg9rWdbFj 6IHtMr6bw1LkWhsP+vWTrOcWl3LIdXV9BSx1ad3r01p6aEVIbl2OgFzPfYf2cYv2co+hI/bg/Idi udBzSXKtiQfdvqXa/EzNyuYoudZJ1B6l7qwpUqP23aAUYkK27m2kxnhE32CelP/3v+cLvUNdijvG kuRaEw86BYyNz8XuIUUerRTwFTPIjFoueIw1fiv3LoyrYmM8G5yzc5pCWty3xNLkWhoPOvcy1nnF QoeU5VctFfA14fpN0dy60oHZWKLEilKL0kEeEmjRoJco15J4MEUBY2W/YjgpUhp6pB6TZ0at9yjR BGbl4rnsoJXF8ntoy7hgaXIF8uPBMGkUQ8vqpjxH7bdWx6SZUW0cp6Zxb4QyX2EXt7ge1WJmvP9w LRVwiXKFUr4WD/oxYCrhC2dS3zl/tWj+f21WsPW8w86oLL+elktdlipXrXypc0pJwmhsT2WuWvkc 2gyT2izREuYdthwfWqpcUzfFdVaeqxQq0YL80vmBPpbzDlvQaiwQWLZcpfLDhEWJC0oUtN7aIi5q 4YpZ4ceALSZmL1muUvlORhucE01LWNg7e2LjNbXuxZzXofkK2KJTWLJctfLvUL9MiAhovbWFizHX eNB3E1vNEVyyXIcGwo+YR0d6FcQGPS0a5xzjQX+4oNWGP0uXqzabyFfCR/T3EntzL0kg1uNZpIzn Fg/641ItJ+guXa4xBdSOPeQlSmSA2PzJWuYUD3Z4e6+t67BkuQ6Vv0V87u3UHe2i0GbIv8Jm2s5c 4sEOb6eMtR4UXrpcc8rfQF/PuMrt5XOJLYdZQtySgq+AY711Z+lyLSl/C31rDrqnEWIp9FprMYc3 oLqNmcbulZcu19Lyx5hQfnW0XAozdTzoK+DY06mWLNfa8jXX1LoD9J/v3I5oyPFL8Pd75Xt/Dwgg hd+V898Nyh5ii7PifQfwLwAvI1zXsWS5auX/lfh7bfDeuvN9wHzd3GiH82vw943yvVSBx5CEPtQI dwC+APiIcqXZ4ez+fDuVVcsdesX6kvj9JctVKv854XdDddE6Jp8OwH8B/In+2cWQhpeeT9f/gb6+ P3Gu98/guzeQ3eQX9HIKvx/+doO+c/+Ey87gOVbxkHAtl1V8URq3uIRAadzku1JWizL9NXupLFmu Uvm5U9NK79258UPfDRf0puxQF2K5V2uYTc56zloqunYWSUlc4Qul9pqWq6L9ZTqpLFWuOesHNbSF xin37jqL1P1rXlGe9NHutTR29euUNQlESyDU+u9acB7z4V3vViJUPytnmYnzG1SOAi1VrqnrB2OU JnZSOwv/ezX7wEj3WjORonjjYi2lXJtGl7JWQwJzLlyuO+BnyaxT4f74Yk5DXKpcU9YPDqENzwzJ z/1uyOOo3aXbId1rjQfldz7ZCaNa9yNE662H4grXwHLcgZYK6D+kkjhhiXItKT+k1MI4d27I43Df qw05pHutCRd8JcxGSiKUViY2SB1ryO4Gct0Bfyqav13hAf3Duke+j++/76HGRVmaXK3GHyVXfMi6 +S5mzIr436uxgtbxIHB2+4tcZMl1KullhragizVA12BzskpSIz9Cd9keEH9wt5BdlNI4bmlytZqP KtV36L7dtYesrlPwWq/HOh4EznUrttBS48sh3KVMcp20xuL3bqk9UdjbPgS/3eDyBSNhz/yI84a/ 2vdqhxSWJFer+ahS6j/WMHPq6epYuwTNOh4Ezopd3GaktHLqjfquknONJCuguU2uYaX2bn7DHJoP GlPEocNimGNJcrXshMJGHquDq+eQvEvGazVyPYoU3H1UlRO6EUMrDjq8dQnDi4cKIAnZV6hUK5g7 H7REES2TPEuQq3U2VypPImfndNcp1e5p0yIeBM7PpXqZnNRgwp47XD8W2zE5dPX8svxrpWYf3XVz hwyGtmqw6P1jzF2uWuKnBukFPY7wjVcpcfcGNvNFW8SDQH8PZm1nA7nRSgmPoYcc9upSOakNxXdH SnqbIYtYMvUph7nKFZAtl8UualKm9Bh8HnvX7RbxYDO26B/EHm9fc/yEvufMnUXhynINXnod9FAZ uY0rxGVAXRZ1f6rXmNttzE2ujvtTPQ6w3X3OWT3fek+5F43UAbfa7IsQEtAqHswiXE9IyJqQ1kq+ IHPpUS1UQrJmpLDDYo1nFlRCsmakWJn73xAyEq1WtmRDS0jWipYBt9j3JwsqIVkrUlJmjE3HCCEn JFe01du4CCEBs4kHAbqjZJ3MJh4EqIRknTAeJGRiGA8SMiGzigcBuqNkfcwqHgSohGR9MB4kZGIY DxIyIbOLBwG6o2RdzC4eBKiEZF1I8eCkCkjI2pBc0Ra76WVBS0jWgrZ5049RayEQvi6bkKXjNmly O7d9QP8aa00JP5/+Dd1S/9XahJABtFddWxzNt2GkO0qugRu0sVrPjcp9w/8B8BiM3jtZd+MAAAAA SUVORK5CYII= "
       preserveAspectRatio="none"
       height="13.623349"
       width="15.639049"
       inkscape:export-xdpi="96"
       inkscape:export-ydpi="96" />
    <image
       y="64.032341"
       x="70.135864"
       id="image1741"
       xlink:href="data:image/png;base64,iVBORw0KGgoAAAANSUhEUgAAAF4AAACsCAYAAADyiBt8AAAABHNCSVQICAgIfAhkiAAACRFJREFU eJztne1x4zYQhl+nAo6vA10HnpTAdOAkHSgdODW4BF8HGV8HTgeJ0oHSQaLrwPlBbbSCd0F8LEBK 2meGE58igeBy8WKxAIk7LMsAYAPgnv396fjf4fg5/f0FwC/LVPO6eAHwnnG8LlPN6+OAPMNvl6lm G+4WPPcI4AGTtJCsjMe/JT4D+LtP1W4TqSUcFq1RA75bugKJ/L50BaxZm+EHyFLz1rsit8Yj5I51 s2SlWrA2j/9B+OwbvFNtzh43Er+vyeNp5Bri+t6Ym9F3YF0e7/q+EJK+X63MrMXjb07f12L4Ufn8 6kasa0NLETuNuSl9B9YhNTen78A6DO/6vhCu7wY8Ysqt7HGa0NgdP9M8++b03YoBwBP0maPQoEPw W8nbnzrVe4upxXFHsT72mBzSlCfhRK+Y5lI5I06evcfJ+Fp+Jvy9JSOmVtjCyNphNnU5YPLe8M5q ckLQb3bHf/fU9wfIstbrqGbEx2a5i/7iHLr4Lfrp+7Nwnp7HS+0FPAiFculIYZyppKW+b5AuKzka v0883mCwHkgy+gF5RidiTd5K3zeIG/MVUx8T1n84fh67YS37oDMko79jXtM1pE7ZTAsRN/pzRjlb pYxu4a71XKh2Iy0uSDP6HmWzWZqTNPd6KfIolRhiI5Rppe+Sk+R0/qllVneYMbSOMKe55pRbKl3E q1BmbucvIUnOvrLMKJpO1k5Aa+FdDS0ny7UWWntDRTRtq222gBwx1JQ7QHYSy6Xd3XRe83aLvIO1 fEn9kLUUtLLFGVoYZdG8rPVdS7RZP8jQ4xyqt1vIjLW+S+W1WE/f3OO1GPsdNuGepb73SitrnWux xktTfz9Hvm8xHSdVtrTcn5TPvxaWp6FFRt8sT6LlKCyar7W+h6npFp0qoEd4ZmhN9x02y6Wt9d06 OtKQBmZVjhhKzfeR7/5Rc6Ijkmf/VViW1rG1SGBJ9a6S3dDwsVFerb4PsNV3ra7Wy0LoyfKQ32oK DQ0fi9FLPZPQWlOph34WPmuxpFtrWVUdeGh46WKAeqMD8vp3wNbjLeoZIr0/obpVhYa/V773Z+2J UKbvIz4uCSEkw1t7/EY5T3UHnrqErzZeLdX3Z0zGly5eqpN1KKl5u7nHax5Te0El+s5vltQy/k38 rBRaqBXyq0XhoeH/Ub5X24R/VD6PSRhJk+ZdrZ+NkuTkK9r0I2qepjbvrM2BxqBBi5Z3kSY+rLKF 0kDSYiYrinUWTlstNjdnSTdLi9cl41iNWqVURPPHPqXhcaknxfL6sQwi5XTmhuWhgSxGrZKjmE94 SEhyU5Kn0eZAU24m3fw5D5bqWiMHkqP0WLn8P1KGMgeehaSl0KmG5xKS0rzDFloqN5KjdPF0jpT4 T60E9xryFskzNU+im5QqG9JEd24wIDlG7VKTYkIPOCDugQPOvS/06FCPJfniLSWnMwtXjx2QZnxp rfxb5rmbIBk/9PwNzj1mD/2iwxVZvCx+rhJdHYTyX4S6bCAvSk1Z398VbamzFJvPGSxsFVI5tZ3Z VqlbbAJ/1a9WfMDkQTucLuKA0xrw3DXyVBZ5m/QITw38HLy+9DDcExoPiBzHcRzHcRzHcRzHcRzH cRzHcRzHcRzHcRzHcRzHcRzHcRzn2rlD/hN9jgFr2IDrJnHDL4Qb3nEcx3Ecx3Ecx3Ecx3Ecx3Ec x3GugrulKyAwYHrX5T37+xNO2wLds7+/QN5OwslEe9e8dljsxuZAfxtqyavQV83apGbE9LbVTzjJ ygj9jaif0X6vkJtGe1fwxXLJ62qs9/TryiUYfoAsNS12sXQY2l4ji79cv4ZL8Hhpc8Zv8E61OeEu CFcRv6/d42nkGuL63pir1Hdg/R7v+r4Qkr5fhcys2eOvWt/XbHhtT6aLHrFeAlqK2GnM1eo7sF6p uWp9B9ZreNf3hXB9N+ARU25lj9OEBu23p3l2b31/PJZP591juvklewHSFqdze5I3YcC0iWHKLpNv OL9AaRN0i10vJUaljvzI3WqUbl7XLadxPKGUTQx3rhxx7mFkfC0/Y7nzpVbPWuM/43Q93RjwcZfi lM1p6Te747976Lu0KfrcMXfjx4zvmiE12V30F+eQ52/RXt+l/cNTjtjW2dzopZu1ZyNdCJeOFHjF W+u7dGNpg9035f/z7/Htrgec5KXrAE8y+gFl0UDsgq2abqjrL9C9eHP8vrRtthQklF53NlqTLd1w PNbZWVHaIgfIYXHLzl/Fei5Uu5FWzZeiJSvP5B3048x3zZAij9oL2ghlWuo7abHFekse8nYzutYR 1vbmWrml0hUyGJXF69l10aw20qudgObRQQt9t4AbvevIVOsAc2J2DSl6sCjXikVidULzdgudayFf VnBN7578ig2za6OE1vpeAzf6Io6gebuFHKxV37m0ds82AvH8hkWF1qjvPGRe7JEfzSOtRmxr0/dX Vo9ucbpELF9Ry5r0fcD5tS7ax2gzQu+wWS69Fn0fcJ4G6ZZ70YilbK9F37nRY3n3rsTCyFqv0FpT T32nyel3TMZfhdGBtunapfWdG32HTvn0VLQ50EuP3x9wMvoqV6jx0IofFkPnEn0f8XFJSC68pVk9 T7WFsURqhq89Sam+080q7V9aGJ3PJZihyUHtaK5E3/nNqj2n5ZODJMem0ZjWudZ2gFrfEZMQSliV aDJPe1hqOvd209SClqepDSWlpNvcCiySvdzxA49erDtSHv+bR0WS4WtyGJq3z3XYZLycWLul0Xlw 0CR7KXWwpc0qNiCLVZ70OTc/xNMAfGnGHtONeEL+oImv+yypUzKS3JR0TtqC1JSbSTc/J5qSHOYA XeaeEZfQR8ghcNMBn3TCHMLZeUluNMPzaCbVO8Og4Dn47QYfF9nyg9bw0yIm7XvN0xvSupdUnefy QnIitSJNaugmpWo0v8lz+ZeY8eeObi+zCKViLpM34Ly5hx4dXrR0IdyIqd6em38pMX73NINk/NDz NziXkj107QybMS+Lnys1aqDz5oZ32mTPIvKisYFcUanTmjNY2CqkclKNzuWwZJwx5/kpD1p04QGT h+1wMtYB0wVskb9Gnsqii5Qe4ZkrI+dGSVDkQtHP7lgvU4P/Bzeg7DTC/V7bAAAAAElFTkSuQmCC  "
       preserveAspectRatio="none"
       height="12.747913"
       width="6.9668818"
       inkscape:export-xdpi="96"
       inkscape:export-ydpi="96" />
    <image
       y="68.581017"
       x="93.019302"
       id="image1752"
       xlink:href="data:image/png;base64,iVBORw0KGgoAAAANSUhEUgAAACwAAAAlCAYAAAA5iwvJAAAABHNCSVQICAgIfAhkiAAAAfhJREFU WIXFmOFtwkAMhT+YIOoI6Qa03YARaEegG9AZGIFuUMEGdIOKbgArwAb0RyhF5BnOdw59UoR0QS8v L7bPvh7lqIAX4AEYAneHtWhsgLcSgiGwAvY3vLY5QgfA+sZCTy8Xpv8odA/MeolCa2BO4+417EiP 4Y3jf3PgPeXPNU3sWG89B0ZCZHVYvxTnKQa4cEns1MEzNjiWtxC7PtzzYiK4Ql1WlWDVAeeskBNo 4lI5W7ohqNBYF3IyEqR78sLgHLXBnW1EhY7bcanSE4TG8UyQFX+yMyjBoxyiyiCLdJfIZ6htN6vZ uIIQhy13J2EyG1hJlxzD/cPvi3F/UaJOwKo0Oy/Rku6TDezdLhm/Dg/FvWh3AZ7Emttda6NQL1EK VePnHoI+dlx9Fklro0bvaB8ekj5wL9ZTG2sPrNLlCj3L4W+3nOt4FWvur2gJjna4Np7jGQKARrDK 0uiSZrmblSeqBmc1IwasXTSrQ+vTTYKdQn32BQV5oupwVIem3C2eXBSpOxkMqHCLmFxaxBHjtxoG wnJjIMhLPpsaNqNb1daknBsWKiciq84RagD1lh4VBl00UUecn/ZsSROtzoqXBCXYNVS0T2hmtIXX 6MO+NR27amGM7l+tw8EV8RN2Cynnw0PgGXjkr6fd0eyQG+CL5tzWPTnk4AeZQXE01nzVPQAAAABJ RU5ErkJggg== "
       preserveAspectRatio="none"
       height="3.3568916"
       width="3.9919786"
       inkscape:export-xdpi="96"
       inkscape:export-ydpi="96" />
    <image
       y="67.68528"
       x="128.88287"
       id="image1763"
       xlink:href="data:image/png;base64,iVBORw0KGgoAAAANSUhEUgAAAOwAAAA9CAYAAACusYWeAAAABHNCSVQICAgIfAhkiAAAB7NJREFU eJztnct120YUhj8nLgCWKwjdgWxXELoDKlllGakD66QCH6kDMRVYVAdSKrDFDswss7LJXZbOYnjD kYSZwWNeAOY7B8cUYXDmAnPnn+fFj6ThGPgN+Bf4J1EeCoVCAxbAd+1YpM1OoVCwseWhw27TZqdQ KJg45aGzynGaMlOFwlB4Fjm9LVDVfL8DXkTOSx0V6RR/B3wDNvvjFljvP/skpY3w1M574Hr/fWjm qPs6NE6Am9iJmtQ1J5WtsOcxxbEFLqiv6MZi43eU44YuA/MM7OxyvBcDYiqsSV2FXFT2Svt8hMrz EWpkuyl3HJTExWz/+zPcTnkDfEApbx9i2wjt7LxE2elbdWfAufZ3LNvr0mtyH4QlcNYyrV641DUn lTVRoWo6lw19lXABrHg6OKcfFz3TMBHLxtk+nXtHOjHLQ4W6ry7bZx7TnKGe95UjzejNeFvh048v sTPWgVvM+V95Tsv2IL/gt/DoxLSxwm7nPeHsrMNWVkM6jq3CiOoXurpe7RPPpVbtgq1wXVmu68ox 5kK0pV1TrimxbQTllCbFDWVnHTbV911Z1WHqZ0dDd9CKpwsnhqaytmZTqMJ8bEkzRGFOYWOTtGMs sonZujBR97wrgB8CJ3zKoTlzieqo32CfqpiRv8rGZs3DwRKdCvgrYl5Cc455gGXFNFbG1T3vKN2C x+oqDFllU6qPrX/lM+2UNgq2gcp5wHRzUFhB958FhFXYOnUVisp2Y2k5d0rYghybJWZ7V/ibl84Z vXKcQViH1SX9g+O86/qCwjVKGXWuLgJn1M85V8RXuxToFdYrCOewNnUVmqjsFPorbbhznF8wPuX5 3fD9HG0F0EjZcaiwgiqsS10F1wKAUAsExswvqTPgmTXmdbQXxJvuSYVU0sEcdoFbXYUlRWXb4lqu 9ypKLuJi6x6NvVL/tP83mMPqN9CmrnX/v8v5qeFavxpzVVAsNpi7A3PGrbK63ZVvh22jrkJRWb+M rQ8r2Abc/oiWi/joPjTz7bBt1bXuui7nCwd875/NBdt+UF0oxsj/A08+HbaLugpFZZtz5Dif86KT Pmywl6khTAMuUGuV245ui294ddiu6lp3fZfzU8HV5HVN/QyZa8u5IYyOz1D97bctr5PoIztfDttH XYWism5czb4N/Te358y95VxF/s3ilx2vWwKvgaUvh+2rrnW/0+X82HEtPRz7/XH1z3Ov0HsPCPpw WB/qKiwd109dZU8s5zbY1xqPAZfDvouSi+64xh+c+HBYX+oquAYPxq4iJmbYFdbmzGPB5bC5b37o nb++DutTXYWisvXYFrufM+6+q46rjOW6iKJN0DUjfR3Wt7oKRWUfcoW5IJ6hKsupMNSVXl72Efdx 2BDqKhSVVVSoIX3T3uATxt9vfYyrnOXosCs8Ndf7OGwodRWmrLIVykn/pv5Br1GL/KNHg88Al8J2 nTrxhUwv6eFLvYnL847XhVRXYYk94r3clKEXWunbSDDrXzE3f3eoimxqqtqGkGupJbTR4DDFavKN KwB5imV4TYJN+z7uidsFyCGmk4kV9nvVNxKFLaaTr6NzHrsobAx1Faaiso+R7WS3HF4LUVC4BKLt 6zPaYNvmJ8jrON4QQMy6OGzovutjzrHX6hfk47Abuk/ef6M4pg9C3sM17eJmVaitf95C2bR12Jjq KgxNZce6vS0Xeq8WioiMOXxExY6OPg8bW12FKY8YFx7iKvQ5bi+0BYJvRRuHTaGuQpmXLQguhf0c JRft8TKy38ZhU6mr4KqhxhwmpHDApbA5d0l671Vu6rAp1VVwqewxRWXHjstZ1+Q9cNc7b00dVlev FOoqFJWdNq5lh7lH2+g95dTEYRccVt6kUlehicrmvsWq0J03jvMfo+SiO1EUNhd1FcqI8XR57Tif +xbDr31/wOWwepDm1OoqFJWdLjaFzWUe3sYStWnD9L4gJy6HTT0ybKKo7PSosG9Oz6l8mtjhDtdq xeawOaqrUFR2etjeF3xH/s1hL9gcNld1FYrKTgvbGt4hBBH3gslhc1ZXoajsdDjGPKUzGXUFs8Pm rq6CK29FZceB7TlORl2h3mGHoK6CK39FZYfPAvMznFK0SKDeYYeirkJR2XHzp+H7G6YVLRJ46rBD UlehqOx4uaV+/fCGHnOZQ+axww5NXYWisuPjCnNFe8IwxMQ7esQJXV3vcK/bzAnXlipR2dwXhxcU K8w7r14zsX6rju6wugrNGV8z8gL3WtQmhIwSmQupbJyhmsF1Uzg74GfCO6ttg3zyZy9NYl1dx4qv vqztgQ4p3pCNFHa8R4V3qXPWNfATcZTV5pTZPN974sfaTXHYXgjclK0jjTFUfDYbfdxDoUI5qim9 LfYlib6RQOG2I2Z+nvAMpTq3KTMRmXc078tKRP4KdZ/OcG+i3gHXqH7YhvzDl3ax8RI1KNTGNv3t Bm9xt+qWqHlWn/dObBTE7pc8jKrShBvg0/7zjqeb04PFk56KujZRiCpC+klraOLY2OdYEe6FVvOI dgQZA3pOnm/7CsnU7B0CdyhHvSbv1khyngMvUmciI3YcVs985VB4usbikUEKaXZB+jCcO9K9TEvu 51dUd2FN3CiHnznMFOjN2D6VhAxSHT36O4hd/wFkNDoeHauGnwAAAABJRU5ErkJggg== "
       preserveAspectRatio="none"
       height="4.5609231"
       width="17.64554"
       inkscape:export-xdpi="96"
       inkscape:export-ydpi="96" />
    <image
       y="67.672646"
       x="107.18443"
       id="image1774"
       xlink:href="data:image/png;base64,iVBORw0KGgoAAAANSUhEUgAAAOsAAAA9CAYAAABMbZ7nAAAABHNCSVQICAgIfAhkiAAACbtJREFU eJztXU1yYzUQ/gY4gJkjmBsYuIHnBoYd28wNQnECKtwgcwTMDZIbDOYGDkt2ODuWw0KvK4rcrfck tX7s6a/qVSpOLOlJ3f21WlLrS/TBBsBPAP4D8E+nNhgMhhnsAHzynl3f5hgMl4E3Heo8AVh5vz8D +LpDOwyfF1YA3no/1wCeADz2bNTIuMFrVqXnpmejDFeDNYB7AA8ADgCOcOTAydyn6f8MAqSOO/Vs lOFqsIWsmBevrF80rOsGr91fHysYuxoMwyDmjhi7GjSxgnOJt3Bu8VUwaytIc1WbuxpaIFyBMGWN YI5V6Tn2aqDh6nHxytpizurPVT/AhcslrGHsaqiD594NuAQc8WLJVpBdEmNXQ034cniRzFob/lz1 zvuc6zibuxpq4gBT1ihCViUYuxpaw5Q1AolVCcauhpYwZY1AYlWCsauhJUxZBcyxKmGOXe1EjkEL pqwC5liVMLdZwtjVoAVTVga+extjVYKxq6EFTFkZLGVVgrGroQVMWQOksirB2NVQG6asAVJZlWDs aqgNU1YPuaxKMHY11IQpq4dcViUYuxpqwpR1QimrEkZn1y3c+z3gPL/PEU4g7qf/4757mv6uDcq0 scdL7iFq18lrVyxbhxY2AG5x3ken6feH6e/ryu0I0VpZwzHx++Ew1X0H119NUcqqhBHZdQXXqdxA 7+GUgJJ0hUpCWyZ3qCMgu6m8WJ9xzwP0heQWvLE9CZ/TeLYywK2UVRoT6gfubPcRrv+qQ4tVCXMH 1Vuya7gl8h7zjLDCa8ENBfWg0K4NeOE7wo3Bdmrnevrfm+nzsC17lDPtJij3AJk5N+DTrBzBeyOa qK2sa5wr6Qmu38O+INYNZf2IykyrxaqEUdjVZ9MD8ty2Pc7bX6qsHMufsNyIrYMyjsh3SX1jlsKS a/BsW5NdaiorJ7NLDSFnvKoQkjarEnqzq9/5R5QZoVBhS5RVUv6c9vkKk/OOftrPfUb9AK9AuWXl 1KWhrLdMuam60ERhtVmV0JNdV0FdGu5Z6CbmgJsH5QobsavfrpTA1wovBrVE4P1yajNsDWXllEzT cKm5xLVYldCLXUM3UwO+8clRVo5Rw2tIlmLDlJVqcEM2oblyDiTDrD1301ZW7ohnCYlw46IR3wBQ j1UJvdhVgwU55JYp9UMu43NCm1qmFN3NFX7OMGtHajWVdc2UpUEgnPdUnIShNqsSWrNr6AJrGgQa iBRllYQi14iE75frfsbKyDEiUiJuTRLQVFYpEl8KbbYGUJ9VCa3ZlXNFtEDudYqice5vqZGK9ecS K66l8D6krCGaqX20lFVqq9Y8WzSAOXmDd3gJ9f+GuvlYP8yUv0b9yLCW55BqWKR3ewbwR0E7/or8 bcn1h3PjnSMPUpu+ySirNiR50Lo6kivnh9zCWrEqoSW7SqyhYRBoqWNptFBi1dKlDSnAlGKUpLbl yoTU75rLOBrMKt1Sp3lPE7eOniXjreaqIVrOXaW69ijfz0o7i5ZA080MQVsoHyDvZZ77Pif82u65 ZpBJQ1mlubX2FlKujmS0ZlVCS3blLJv/HFB/Q3zsntHmG78j2MIZD43+kPpaCxrKKhlyzcMZ0tgn jXsvViW0Yte5AEpoJPZwAqupRLFrCq8VoyurFJnX8nYI0jQlyfvpxaqEOXbVHNilV1RK7Sg9+iSt Y17zHbajK2ssz7XmNEyMm3yV0NBWEWAJH+CUQDIUG7h2lkRK/bpoXpeKDV7OdD4B+DmjTdK89t+M 9vTECsB3cP3x/fT7W7j362HwSxCLNdwBeK9Uz9vEz8/gW6WendySXQGn/Evvlp1rV0q/tXq/GlhD PtvKeQp0aH90Zp2LZdR8TljoqfWeq4aYUx7tc5ErxJcqUjp8Sdtic6OR05DsICvdCfNz+9GVNSYD wwT9RmFVQmt2JdCh8pzMDCkDe2nKuoXMogcsn8+NrqyxoN8QyuqHkUdgVUJrduVAt7Tvsczl81km hlg0ejQ3WBLgnIwHoytrzA0eQllHY1VCL3aNgW51j1lgeubW5aTvjZLhUdoU8Qn5u45GV9aYzPVO 5DcsqxJGYNcYuBw7/hND7vdaQfIkSrYHjq6ssaWb7ncJj8qqhBrsSpkLNHekSIGJ2ADH5sW9Ib1P qWKNrqyx6UmTzIQSRmdVgja7+rtHNMEJeMwgxAxRz/lRLPhVum96dGWVyij1KIoxOqsSuGRVJYPt GyltNzo0LDFBGdWK1zoJBKFcafzW099S6tVQVkneuu0suxRWJWiyq//u2pnzw2jiXLBIsuK1lm82 iO8QixkQDcOWoqzkAaUoiYayxjyLWqS2QeTE16WwKkGTXX1l1baW4WmKuXbFTt7UAAWNpMhmzfak pq/ppaxAXgyiBNTus3G5NFYlaLFrKJCa88NQIJe4cBK7aguGP1eXDHRsHl0KyRCMqKySYamxrPYq hhKmdfEV9NcKldfCXFtzDY/W5mzgXAk+LvjOz4mf5+KX6ecj5EMakhJrHOrITlvSAU9wBz1CrKEf 5yC5fQQA/9TNFi9M8gh3WuJS8DTz9w3c+6XmybmBUwwNgQznHEva8gh3yikMKtHuKU5oUkGnlYC4 EZD6WGOq9GPi/9MJlF6nkN6Dz/pxB+BbpTpIZqm+V4jlk72GZ8nclXPHtMLy/lwnNUotrbtqXJtI 4z73nrHgSgmjUMyBc7Ml15L+N8WN5aZKJUtD0m0CGtNHv+yzQGcseHBNz5xQSf1QOkcMT//n5Dzi dg2V3sNDWyOXZvfX3hBBBoAMBVc21y6KrKcoBld26TxTyupQKi/RHNPXzqpLhSpmtHL3f4aKlmt5 V5Dv/cxhWH8P89JA2hpyMC9VQKks31Bw+6rD/vKXkJa+dyw4VjrPlPokZ5x9WWEN8efCqksGR3KD cwcgvLtUw6WWDgos3SwR3u2aGvGO3ZWztA2+8vj1S2u5lJDNvwOV60s6+H43PUtPRNHN8PS9W6R5 LNLBhpRLq/0lSNFj+lxY1R8YCaGy3nqf+9fMxw5RU3LukAU1dx5JZ0hpXzMFP0jAKQuhP9a5d84C /MXBfrmcF0JBMWq3lP0gtmHer4MTZk3iyekb6fAGXTAdjgt3Siu6GUcjbcklPbG1OZ81QhZdQ77N Tbp+njpfIxDE4QbpxpZSqWpgi/ihA6lv5jwUKZ0OGcpYe3oqK2FpWhv/mWXhNwUNukasAPwNtyQi LWPQFfPv4Ja3yMI/wy0lPAP4E67zY+uWmljBLX+8gxMyst7PcEsu9Nxjfpkrt/7tVD8lRPOToj3B XZHxAOB3LO+THVyiNcCtS2skw2sJYk+/X8Jx+Yj5a2IAAP8DlRZKZPaTjY0AAAAASUVORK5CYII= "
       preserveAspectRatio="none"
       height="4.5355363"
       width="17.472967"
       inkscape:export-xdpi="96"
       inkscape:export-ydpi="96" />
    <path
       inkscape:connector-curvature="0"
       id="path1687"
       d="M 42.110601,143.28243 H 147.94392"
       style="fill:none;stroke:#000000;stroke-width:0.30000001;stroke-linecap:butt;stroke-linejoin:miter;stroke-miterlimit:4;stroke-dasharray:none;stroke-opacity:1"
       inkscape:export-xdpi="96"
       inkscape:export-ydpi="96" />
    <path
       inkscape:connector-curvature="0"
       id="path1689"
       d="M 42.110601,122.64492 H 147.94392"
       style="fill:none;stroke:#000000;stroke-width:0.30000001;stroke-linecap:butt;stroke-linejoin:miter;stroke-miterlimit:4;stroke-dasharray:none;stroke-opacity:1"
       inkscape:export-xdpi="96"
       inkscape:export-ydpi="96" />
    <path
       inkscape:connector-curvature="0"
       id="path1691"
       d="M 42.110601,102.00746 H 147.94392"
       style="fill:none;stroke:#000000;stroke-width:0.30000001;stroke-linecap:butt;stroke-linejoin:miter;stroke-miterlimit:4;stroke-dasharray:none;stroke-opacity:1"
       inkscape:export-xdpi="96"
       inkscape:export-ydpi="96" />
    <path
       inkscape:connector-curvature="0"
       id="path1693"
       d="M 42.110601,81.369968 H 147.94392"
       style="fill:none;stroke:#000000;stroke-width:0.60000002;stroke-linecap:butt;stroke-linejoin:miter;stroke-miterlimit:4;stroke-dasharray:none;stroke-opacity:1"
       inkscape:export-xdpi="96"
       inkscape:export-ydpi="96" />
    <text
       id="text1737"
       y="93.648827"
       x="25.89135"
       style="font-style:normal;font-weight:normal;font-size:10.58333397px;line-height:1.25;font-family:sans-serif;letter-spacing:0px;word-spacing:0px;fill:#000000;fill-opacity:1;stroke:none;stroke-width:0.08063701;stroke-miterlimit:4;stroke-dasharray:none;stroke-opacity:1"
       xml:space="preserve"
       inkscape:export-xdpi="96"
       inkscape:export-ydpi="96"><tspan
         style="font-style:normal;font-variant:normal;font-weight:normal;font-stretch:normal;font-size:6.79097223px;font-family:'Linux Libertine O';-inkscape-font-specification:'Linux Libertine O';stroke-width:0.08063701"
         y="93.648827"
         x="25.89135"
         id="tspan1735"
         sodipodi:role="line">CSS</tspan></text>
    <text
       id="text1741"
       y="114.43751"
       x="25.513378"
       style="font-style:normal;font-weight:normal;font-size:10.58333397px;line-height:1.25;font-family:sans-serif;letter-spacing:0px;word-spacing:0px;fill:#000000;fill-opacity:1;stroke:none;stroke-width:0.08063701;stroke-miterlimit:4;stroke-dasharray:none;stroke-opacity:1"
       xml:space="preserve"
       inkscape:export-xdpi="96"
       inkscape:export-ydpi="96"><tspan
         style="font-style:normal;font-variant:normal;font-weight:normal;font-stretch:normal;font-size:7.05555582px;font-family:'Linux Libertine O';-inkscape-font-specification:'Linux Libertine O';stroke-width:0.08063701"
         y="114.43751"
         x="25.513378"
         id="tspan1739"
         sodipodi:role="line">DIV</tspan></text>
    <text
       id="text1745"
       y="135.41519"
       x="24.946411"
       style="font-style:normal;font-weight:normal;font-size:10.58333397px;line-height:1.25;font-family:sans-serif;letter-spacing:0px;word-spacing:0px;fill:#000000;fill-opacity:1;stroke:none;stroke-width:0.08063701;stroke-miterlimit:4;stroke-dasharray:none;stroke-opacity:1"
       xml:space="preserve"
       inkscape:export-xdpi="96"
       inkscape:export-ydpi="96"><tspan
         style="font-style:normal;font-variant:normal;font-weight:normal;font-stretch:normal;font-size:7.05555582px;font-family:'Linux Libertine O';-inkscape-font-specification:'Linux Libertine O';stroke-width:0.08063701"
         y="135.41519"
         x="24.946411"
         id="tspan1743"
         sodipodi:role="line">NLO</tspan></text>
    <text
       id="text1749"
       y="156.01488"
       x="24.568441"
       style="font-style:normal;font-weight:normal;font-size:10.58333397px;line-height:1.25;font-family:sans-serif;letter-spacing:0px;word-spacing:0px;fill:#000000;fill-opacity:1;stroke:none;stroke-width:0.08063701;stroke-miterlimit:4;stroke-dasharray:none;stroke-opacity:1"
       xml:space="preserve"
       inkscape:export-xdpi="96"
       inkscape:export-ydpi="96"><tspan
         style="font-style:normal;font-variant:normal;font-weight:normal;font-stretch:normal;font-size:7.05555582px;font-family:'Linux Libertine O';-inkscape-font-specification:'Linux Libertine O';stroke-width:0.08063701"
         y="156.01488"
         x="24.568441"
         id="tspan1747"
         sodipodi:role="line">NPM</tspan></text>
    <path
       inkscape:connector-curvature="0"
       id="path1751"
       d="M 42.110584,60.732486 H 147.94391"
       style="fill:none;stroke:#000000;stroke-width:0.00042671;stroke-linecap:butt;stroke-linejoin:miter;stroke-miterlimit:4;stroke-dasharray:none;stroke-opacity:1"
       inkscape:export-xdpi="96"
       inkscape:export-ydpi="96" />
    <path
       inkscape:connector-curvature="0"
       id="path1755"
       d="M 42.110584,163.91999 V 60.732486"
       style="fill:none;stroke:#000000;stroke-width:0.60000002;stroke-linecap:butt;stroke-linejoin:miter;stroke-miterlimit:4;stroke-dasharray:none;stroke-opacity:1"
       inkscape:export-xdpi="96"
       inkscape:export-ydpi="96" />
    <path
       style="opacity:0.7;fill:none;stroke:#000000;stroke-width:0.6;stroke-linecap:butt;stroke-linejoin:miter;stroke-miterlimit:4;stroke-dasharray:none;stroke-opacity:1"
       d="M 147.94391,60.732475 V 163.91998"
       id="path1780-3-6-3"
       inkscape:connector-curvature="0"
       inkscape:export-xdpi="96"
       inkscape:export-ydpi="96" />
    <path
       inkscape:connector-curvature="0"
       id="path1780"
       d="M 63.277263,60.732466 V 163.91997"
       style="opacity:0.7;fill:none;stroke:#000000;stroke-width:0.30000001;stroke-linecap:butt;stroke-linejoin:miter;stroke-miterlimit:4;stroke-dasharray:none;stroke-opacity:1"
       inkscape:export-xdpi="96"
       inkscape:export-ydpi="96" />
    <path
       inkscape:connector-curvature="0"
       id="path1782"
       d="M 84.443921,60.732466 V 163.91997"
       style="opacity:0.7;fill:none;stroke:#000000;stroke-width:0.30000001;stroke-linecap:butt;stroke-linejoin:miter;stroke-miterlimit:4;stroke-dasharray:none;stroke-opacity:1"
       inkscape:export-xdpi="96"
       inkscape:export-ydpi="96" />
    <path
       inkscape:connector-curvature="0"
       id="path1784"
       d="M 105.61059,60.732466 V 163.91997"
       style="opacity:0.7;fill:none;stroke:#000000;stroke-width:0.60000002;stroke-linecap:butt;stroke-linejoin:miter;stroke-miterlimit:4;stroke-dasharray:none;stroke-opacity:1"
       inkscape:export-xdpi="96"
       inkscape:export-ydpi="96" />
    <path
       inkscape:connector-curvature="0"
       id="path1786"
       d="M 126.77726,60.732466 V 163.91997"
       style="opacity:0.7;fill:none;stroke:#000000;stroke-width:0.30000001;stroke-linecap:butt;stroke-linejoin:miter;stroke-miterlimit:4;stroke-dasharray:none;stroke-opacity:1"
       inkscape:export-xdpi="96"
       inkscape:export-ydpi="96" />
    <path
       inkscape:connector-curvature="0"
       id="path1780-3"
       d="M 21.4731,60.732466 V 163.91997"
       style="opacity:0.7;fill:none;stroke:#000000;stroke-width:0.60000002;stroke-linecap:butt;stroke-linejoin:miter;stroke-miterlimit:4;stroke-dasharray:none;stroke-opacity:1"
       inkscape:export-xdpi="96"
       inkscape:export-ydpi="96" />
    <path
       style="opacity:0.7;fill:none;stroke:#000000;stroke-width:0.00047625;stroke-linecap:butt;stroke-linejoin:miter;stroke-miterlimit:4;stroke-dasharray:none;stroke-opacity:1"
       d="m 147.94391,60.732476 41.275,1e-5"
       id="path176"
       inkscape:connector-curvature="0" />
    <path
       style="opacity:0.7;fill:none;stroke:#000000;stroke-width:0.00047625;stroke-linecap:butt;stroke-linejoin:miter;stroke-miterlimit:4;stroke-dasharray:none;stroke-opacity:1"
       d="m 21.4731,60.732466 20.637491,10e-6"
       id="path217"
       inkscape:connector-curvature="0"
       inkscape:export-xdpi="96"
       inkscape:export-ydpi="96" />
    <path
       style="opacity:0.7;fill:none;stroke:#000000;stroke-width:0.60000002;stroke-linecap:butt;stroke-linejoin:miter;stroke-miterlimit:4;stroke-dasharray:none;stroke-opacity:1"
       d="m 21.4731,81.369956 20.637501,1e-5"
       id="path217-1"
       inkscape:connector-curvature="0"
       inkscape:export-xdpi="96"
       inkscape:export-ydpi="96" />
    <path
       style="opacity:0.7;fill:none;stroke:#000000;stroke-width:0.30000001;stroke-linecap:butt;stroke-linejoin:miter;stroke-miterlimit:4;stroke-dasharray:none;stroke-opacity:1"
       d="m 21.47311,102.00745 20.637491,10e-6"
       id="path217-2"
       inkscape:connector-curvature="0"
       inkscape:export-xdpi="96"
       inkscape:export-ydpi="96" />
    <path
       style="opacity:0.7;fill:none;stroke:#000000;stroke-width:0.30000001;stroke-linecap:butt;stroke-linejoin:miter;stroke-miterlimit:4;stroke-dasharray:none;stroke-opacity:1"
       d="m 21.47311,122.64491 20.637491,1e-5"
       id="path217-7"
       inkscape:connector-curvature="0"
       inkscape:export-xdpi="96"
       inkscape:export-ydpi="96" />
    <path
       style="opacity:0.7;fill:none;stroke:#000000;stroke-width:0.30000001;stroke-linecap:butt;stroke-linejoin:miter;stroke-miterlimit:4;stroke-dasharray:none;stroke-opacity:1"
       d="m 21.47311,143.28242 20.637491,1e-5"
       id="path217-0"
       inkscape:connector-curvature="0"
       inkscape:export-xdpi="96"
       inkscape:export-ydpi="96" />
    <path
       style="fill:none;stroke:#009500;stroke-width:1;stroke-linecap:round;stroke-linejoin:round;stroke-miterlimit:4;stroke-dasharray:none;stroke-opacity:1"
       d="m 69.748,154.78596 3.349958,2.56737 5.169951,-7.24881"
       id="path1824"
       inkscape:connector-curvature="0"
       sodipodi:nodetypes="ccc"
       inkscape:export-xdpi="96"
       inkscape:export-ydpi="96" />
    <g
       id="g1832"
       transform="rotate(135,135.66548,163.15382)"
       style="stroke:#cb0000;stroke-width:1;stroke-linecap:round;stroke-miterlimit:4;stroke-dasharray:none;stroke-opacity:1"
       inkscape:export-xdpi="96"
       inkscape:export-ydpi="96">
      <path
         inkscape:connector-curvature="0"
         id="path1826"
         d="m 182.5625,228.20834 h 10.58333"
         style="fill:none;stroke:#cb0000;stroke-width:1;stroke-linecap:round;stroke-linejoin:miter;stroke-miterlimit:4;stroke-dasharray:none;stroke-opacity:1" />
      <path
         inkscape:connector-curvature="0"
         id="path1828"
         d="M 187.85416,233.5 V 222.91667"
         style="fill:none;stroke:#cb0000;stroke-width:1;stroke-linecap:round;stroke-linejoin:miter;stroke-miterlimit:4;stroke-dasharray:none;stroke-opacity:1" />
    </g>
    <path
       style="fill:none;stroke:#009500;stroke-width:1;stroke-linecap:round;stroke-linejoin:round;stroke-miterlimit:4;stroke-dasharray:none;stroke-opacity:1"
       d="m 48.442829,91.401521 3.349959,2.567369 5.16995,-7.24881"
       id="path1824-8"
       inkscape:connector-curvature="0"
       sodipodi:nodetypes="ccc"
       inkscape:export-xdpi="96"
       inkscape:export-ydpi="96" />
    <path
       style="fill:none;stroke:#009500;stroke-width:1;stroke-linecap:round;stroke-linejoin:round;stroke-miterlimit:4;stroke-dasharray:none;stroke-opacity:1"
       d="m 48.710109,113.05036 3.349961,2.56737 5.169947,-7.24881"
       id="path1824-9"
       inkscape:connector-curvature="0"
       sodipodi:nodetypes="ccc"
       inkscape:export-xdpi="96"
       inkscape:export-ydpi="96" />
    <path
       style="fill:none;stroke:#009500;stroke-width:1;stroke-linecap:round;stroke-linejoin:round;stroke-miterlimit:4;stroke-dasharray:none;stroke-opacity:1"
       d="m 48.44284,134.69919 3.349958,2.56737 5.169951,-7.24881"
       id="path1824-7"
       inkscape:connector-curvature="0"
       sodipodi:nodetypes="ccc"
       inkscape:export-xdpi="96"
       inkscape:export-ydpi="96" />
    <g
       id="g1832-3"
       transform="rotate(135,150.28751,157.25043)"
       style="stroke:#cb0000;stroke-width:1;stroke-linecap:round;stroke-miterlimit:4;stroke-dasharray:none;stroke-opacity:1"
       inkscape:export-xdpi="96"
       inkscape:export-ydpi="96">
      <path
         inkscape:connector-curvature="0"
         id="path1826-6"
         d="m 182.5625,228.20834 h 10.58333"
         style="fill:none;stroke:#cb0000;stroke-width:1;stroke-linecap:round;stroke-linejoin:miter;stroke-miterlimit:4;stroke-dasharray:none;stroke-opacity:1" />
      <path
         inkscape:connector-curvature="0"
         id="path1828-1"
         d="M 187.85416,233.5 V 222.91667"
         style="fill:none;stroke:#cb0000;stroke-width:1;stroke-linecap:round;stroke-linejoin:miter;stroke-miterlimit:4;stroke-dasharray:none;stroke-opacity:1" />
    </g>
    <g
       id="g1832-2"
       transform="rotate(135,154.90476,146.48135)"
       style="stroke:#cb0000;stroke-width:1;stroke-linecap:round;stroke-miterlimit:4;stroke-dasharray:none;stroke-opacity:1"
       inkscape:export-xdpi="96"
       inkscape:export-ydpi="96">
      <path
         inkscape:connector-curvature="0"
         id="path1826-9"
         d="m 182.5625,228.20834 h 10.58333"
         style="fill:none;stroke:#cb0000;stroke-width:1;stroke-linecap:round;stroke-linejoin:miter;stroke-miterlimit:4;stroke-dasharray:none;stroke-opacity:1" />
      <path
         inkscape:connector-curvature="0"
         id="path1828-3"
         d="M 187.85416,233.5 V 222.91667"
         style="fill:none;stroke:#cb0000;stroke-width:1;stroke-linecap:round;stroke-linejoin:miter;stroke-miterlimit:4;stroke-dasharray:none;stroke-opacity:1" />
    </g>
    <g
       id="g1832-8"
       transform="rotate(135,159.22232,136.05784)"
       style="stroke:#cb0000;stroke-width:1;stroke-linecap:round;stroke-miterlimit:4;stroke-dasharray:none;stroke-opacity:1"
       inkscape:export-xdpi="96"
       inkscape:export-ydpi="96">
      <path
         inkscape:connector-curvature="0"
         id="path1826-4"
         d="m 182.5625,228.20834 h 10.58333"
         style="fill:none;stroke:#cb0000;stroke-width:1;stroke-linecap:round;stroke-linejoin:miter;stroke-miterlimit:4;stroke-dasharray:none;stroke-opacity:1" />
      <path
         inkscape:connector-curvature="0"
         id="path1828-5"
         d="M 187.85416,233.5 V 222.91667"
         style="fill:none;stroke:#cb0000;stroke-width:1;stroke-linecap:round;stroke-linejoin:miter;stroke-miterlimit:4;stroke-dasharray:none;stroke-opacity:1" />
    </g>
    <g
       id="g1832-0"
       transform="rotate(135,165.19463,150.74356)"
       style="stroke:#cb0000;stroke-width:1;stroke-linecap:round;stroke-miterlimit:4;stroke-dasharray:none;stroke-opacity:1"
       inkscape:export-xdpi="96"
       inkscape:export-ydpi="96">
      <path
         inkscape:connector-curvature="0"
         id="path1826-3"
         d="m 182.5625,228.20834 h 10.58333"
         style="fill:none;stroke:#cb0000;stroke-width:1;stroke-linecap:round;stroke-linejoin:miter;stroke-miterlimit:4;stroke-dasharray:none;stroke-opacity:1" />
      <path
         inkscape:connector-curvature="0"
         id="path1828-6"
         d="M 187.85416,233.5 V 222.91667"
         style="fill:none;stroke:#cb0000;stroke-width:1;stroke-linecap:round;stroke-linejoin:miter;stroke-miterlimit:4;stroke-dasharray:none;stroke-opacity:1" />
    </g>
    <g
       id="g1832-1"
       transform="rotate(135,169.56756,140.18642)"
       style="stroke:#cb0000;stroke-width:1;stroke-linecap:round;stroke-miterlimit:4;stroke-dasharray:none;stroke-opacity:1"
       inkscape:export-xdpi="96"
       inkscape:export-ydpi="96">
      <path
         inkscape:connector-curvature="0"
         id="path1826-0"
         d="m 182.5625,228.20834 h 10.58333"
         style="fill:none;stroke:#cb0000;stroke-width:1;stroke-linecap:round;stroke-linejoin:miter;stroke-miterlimit:4;stroke-dasharray:none;stroke-opacity:1" />
      <path
         inkscape:connector-curvature="0"
         id="path1828-63"
         d="M 187.85416,233.5 V 222.91667"
         style="fill:none;stroke:#cb0000;stroke-width:1;stroke-linecap:round;stroke-linejoin:miter;stroke-miterlimit:4;stroke-dasharray:none;stroke-opacity:1" />
    </g>
    <path
       style="fill:none;stroke:#009500;stroke-width:1;stroke-linecap:round;stroke-linejoin:round;stroke-miterlimit:4;stroke-dasharray:none;stroke-opacity:1"
       d="m 90.136879,133.89737 3.349961,2.56737 5.16995,-7.24881"
       id="path1824-4"
       inkscape:connector-curvature="0"
       sodipodi:nodetypes="ccc"
       inkscape:export-xdpi="96"
       inkscape:export-ydpi="96" />
    <path
       style="fill:none;stroke:#009500;stroke-width:1;stroke-linecap:round;stroke-linejoin:round;stroke-miterlimit:4;stroke-dasharray:none;stroke-opacity:1"
       d="m 90.404158,155.01167 3.349961,2.56737 5.169951,-7.24881"
       id="path1824-76"
       inkscape:connector-curvature="0"
       sodipodi:nodetypes="ccc"
       inkscape:export-xdpi="96"
       inkscape:export-ydpi="96" />
    <path
       style="fill:none;stroke:#009500;stroke-width:1;stroke-linecap:round;stroke-linejoin:round;stroke-miterlimit:4;stroke-dasharray:none;stroke-opacity:1"
       d="m 111.51845,92.203331 3.34996,2.567371 5.16995,-7.248811"
       id="path1824-5"
       inkscape:connector-curvature="0"
       sodipodi:nodetypes="ccc"
       inkscape:export-xdpi="96"
       inkscape:export-ydpi="96" />
    <path
       style="fill:none;stroke:#009500;stroke-width:1;stroke-linecap:round;stroke-linejoin:round;stroke-miterlimit:4;stroke-dasharray:none;stroke-opacity:1"
       d="m 111.25117,113.05035 3.34996,2.56737 5.16995,-7.24881"
       id="path1824-6"
       inkscape:connector-curvature="0"
       sodipodi:nodetypes="ccc"
       inkscape:export-xdpi="96"
       inkscape:export-ydpi="96" />
    <path
       style="fill:none;stroke:#009500;stroke-width:1;stroke-linecap:round;stroke-linejoin:round;stroke-miterlimit:4;stroke-dasharray:none;stroke-opacity:1"
       d="m 111.78572,133.63011 3.34996,2.56737 5.16995,-7.24881"
       id="path1824-93"
       inkscape:connector-curvature="0"
       sodipodi:nodetypes="ccc"
       inkscape:export-xdpi="96"
       inkscape:export-ydpi="96" />
    <path
       style="fill:none;stroke:#009500;stroke-width:1;stroke-linecap:round;stroke-linejoin:round;stroke-miterlimit:4;stroke-dasharray:none;stroke-opacity:1"
       d="m 133.43454,113.05035 3.34996,2.56737 5.16995,-7.24881"
       id="path1824-74"
       inkscape:connector-curvature="0"
       sodipodi:nodetypes="ccc"
       inkscape:export-xdpi="96"
       inkscape:export-ydpi="96" />
    <path
       style="fill:none;stroke:#009500;stroke-width:1;stroke-linecap:round;stroke-linejoin:round;stroke-miterlimit:4;stroke-dasharray:none;stroke-opacity:1"
       d="m 133.16728,134.16464 3.34996,2.56737 5.16995,-7.24881"
       id="path1824-52"
       inkscape:connector-curvature="0"
       sodipodi:nodetypes="ccc"
       inkscape:export-xdpi="96"
       inkscape:export-ydpi="96" />
    <path
       style="fill:none;stroke:#009500;stroke-width:1;stroke-linecap:round;stroke-linejoin:round;stroke-miterlimit:4;stroke-dasharray:none;stroke-opacity:1"
       d="m 133.70181,155.01167 3.34996,2.56737 5.16995,-7.24881"
       id="path1824-54"
       inkscape:connector-curvature="0"
       sodipodi:nodetypes="ccc"
       inkscape:export-xdpi="96"
       inkscape:export-ydpi="96" />
    <g
       id="g1832-7"
       transform="rotate(135,191.02739,149.23194)"
       style="stroke:#cb0000;stroke-width:1;stroke-linecap:round;stroke-miterlimit:4;stroke-dasharray:none;stroke-opacity:1"
       inkscape:export-xdpi="96"
       inkscape:export-ydpi="96">
      <path
         inkscape:connector-curvature="0"
         id="path1826-44"
         d="m 182.5625,228.20834 h 10.58333"
         style="fill:none;stroke:#cb0000;stroke-width:1;stroke-linecap:round;stroke-linejoin:miter;stroke-miterlimit:4;stroke-dasharray:none;stroke-opacity:1" />
      <path
         inkscape:connector-curvature="0"
         id="path1828-30"
         d="M 187.85416,233.5 V 222.91667"
         style="fill:none;stroke:#cb0000;stroke-width:1;stroke-linecap:round;stroke-linejoin:miter;stroke-miterlimit:4;stroke-dasharray:none;stroke-opacity:1" />
    </g>
    <path
       style="fill:none;stroke:#009500;stroke-width:1;stroke-linecap:round;stroke-linejoin:round;stroke-miterlimit:4;stroke-dasharray:none;stroke-opacity:1"
       d="m 111.78571,154.7444 3.34996,2.56737 5.16995,-7.24881"
       id="path1824-76-4"
       inkscape:connector-curvature="0"
       sodipodi:nodetypes="ccc"
       inkscape:export-xdpi="96"
       inkscape:export-ydpi="96" />
    <path
       style="fill:#000000;stroke:#000000;stroke-width:0.6;stroke-linecap:butt;stroke-linejoin:miter;stroke-opacity:1;fill-opacity:1;stroke-miterlimit:4;stroke-dasharray:none;opacity:0.7"
       d="m 21.4731,60.732466 126.47081,1.8e-5"
       id="path3792"
       inkscape:connector-curvature="0"
       inkscape:export-xdpi="96"
       inkscape:export-ydpi="96" />
    <path
       style="fill:none;stroke:#000000;stroke-width:0.6;stroke-linecap:butt;stroke-linejoin:miter;stroke-opacity:1;stroke-miterlimit:4;stroke-dasharray:none;opacity:0.7"
       d="m 21.4731,163.91997 126.47081,1e-5"
       id="path4599"
       inkscape:connector-curvature="0"
       inkscape:export-xdpi="96"
       inkscape:export-ydpi="96" />
    <path
       style="fill:#000000;stroke:#000000;stroke-width:0.26458332px;stroke-linecap:butt;stroke-linejoin:miter;stroke-opacity:1;fill-opacity:0.16042781"
       d="m 42.110583,163.91999 -20.637483,-2e-5 V 60.732466 l 126.47081,1.8e-5 1e-5,20.637484 H 42.110601 Z"
       id="path4601"
       inkscape:connector-curvature="0"
       inkscape:export-xdpi="96"
       inkscape:export-ydpi="96" />
    <path
       style="fill:none;stroke:#000000;stroke-width:0.26458332px;stroke-linecap:butt;stroke-linejoin:miter;stroke-opacity:1"
       d="m 42.110601,81.369968 -1.8e-5,82.550022"
       id="path4603"
       inkscape:connector-curvature="0"
       inkscape:export-xdpi="96"
       inkscape:export-ydpi="96" />
  </g>
</svg>
